{"text_format":"1","workbook":"xlsx","n_sheets":15,"sheets":["Deckblatt","Lager_Ri","Lager_Schwein","Coferm","Betrieb","Lager_Gefl.","Lager_Schaf","Hilfe","JNS-Th","Ergebnis","Tipla_Mi","TIPLA_S","WD-Anfall","MAKRO1.XLM","MAKRO2.XLM"],"not_rendered":{"charts":0,"images":2,"macros":1,"external_links":0,"defined_names":31,"comments":5,"pivot_tables":0},"unopened":[],"bounds":{"document_bytes":16777216,"sheet_cells":100000,"rows_first":2000,"rows_last":500,"rows_between":2000,"halvings":0,"cell_chars":16384,"cell_head_chars":4096},"cells_cut":0,"cells_raw":0,"read":"whole","date_system":"1900"}

{"sheet":"Deckblatt","index":0,"n_rows":43,"n_cols":15,"rows_kept":43,"cut":false,"hidden":false,"merged":[[0,0,0,16],[14,1,14,3],[16,1,16,3],[18,1,18,3],[38,0,38,17],[20,1,20,3],[22,1,22,3],[14,4,14,16],[16,4,16,16],[18,4,18,16],[20,4,20,16],[22,4,22,16],[5,4,5,16],[7,4,7,16],[9,4,9,16],[24,4,24,15],[30,14,30,16],[32,14,32,16],[26,4,26,16],[28,14,28,16],[42,3,42,13]]}
["Ermittlung der Lagerkapazität für Wirtschaftsdünger"]
[null,null,null,null,null,null,null,"\"Lagerka Thüringen\""]
[null,null,null,null,null,null,null,"Version \"2017-2.8\""]
[]
[]
["mitwirk. Unternehmen:",null,null,null," "]
[]
["Bearbeiter:",null,null,null," "]
[]
["Tel./email:"]
[]
[]
[null,"Allgemeine Angaben:"]
[]
[null,"Name des Betriebes:",null,null," "]
[]
[null,"Straße/Nummer:",null,null," "]
[]
[null,"PLZ/Ort:",null,null," "]
[]
[null,"Tel./email:",null,null," "]
[]
[null,"Ansprechpartner:",null,null," "]
[]
[null,"Unternehmensnummer:",null,null,160000000000]
[]
[null,"Name / Ort der Anlage:",null,null," "]
[]
[null,"Berechnung im Rahmen der/des",null,null,null,null,null,null,null,null,null,null,null,null," "]
[]
[null,"Datum der Berechnung",null,null,null,null,null,null,null,null,null,null,null,null," "]
[]
[null,"Jahresniederschlag in mm",null,null,null,null,null,null,null,null,null,null,null,null,1000]
[]
[]
[]
[]
[]
[]
[]
[]
[]
[null,null,null,"   Sächsisches Landesamt für Umwelt, Landwirtschaft und Geologie"]

{"sheet":"Lager_Ri","index":1,"n_rows":16378,"n_cols":20,"rows_kept":16378,"cut":false,"hidden":false,"merged":[[41,0,44,7],[1,6,1,7],[1,14,1,16],[4,15,4,16],[5,15,5,16],[6,15,6,16],[31,8,37,16]]}
["Flüssig- und Festmistanfall für Rinder",null,null,null,null,null,{"$f":"Deckblatt!H3","v":"Version \"2017-2.8\""},{"$f":"Deckblatt!O31","v":" "},"Silosickersaftanfall und -lagerkapazität",null,null,null,null,null,null,{"$f":"Deckblatt!H3","v":"Version \"2017-2.8\""},{"$f":"Deckblatt!O31","v":" "}]
["Betrieb:",{"$f":"Deckblatt!E15","v":" "},null,null,null,"Untern.-Nr.:",{"$f":"Deckblatt!E25","v":160000000000},null,"Betrieb:",{"$f":"B2","v":" "},null,null,null,"Untern.-Nr.:",{"$f":"G2","v":160000000000}]
["mitwirk.  Untern.:",{"$f":"Deckblatt!E6","v":" "},null,null,null,"Bearbeiter:",{"$f":"Deckblatt!E8","v":" "},null,"mitwirkendes Unternehmen:",{"$f":"Deckblatt!E6","v":" "},null,null,null,"Bearbeiter:",{"$f":"Deckblatt!E8","v":" "}]
[null,null,null,null,null,null,"Variante:"," ","Jahresniederschlag in mm","(langjähriges Mittel)",null,{"$f":"Deckblatt!O33","v":1000},null,null,"Variante:",{"$f":"H4","v":" "}]
[null,"Tierplätze","Tierplätze","Tierplätze","Tierplätze","Tierplätze","Anfall in m³","Anfall in m³",null,"Silohöhe","Silofläche","Fläche der ","einmünd.","Niederschlag","Sickersaft-","anzurechn."]
[null,"gesamt","Gülle","Tiefstreu mit","Tiefstreu ohne","Flachstreu","Gülle/Jauche","Festmist","Bezeichnung der Siloanlage",null," gesamt","größten Kammer","Flächen","Anfall für","behälter","Siloraum"]
[null,"darunter:",null,"sep. Fressber.","sep. Fressber.",null,1,{"$f":"Betrieb!A6","v":1},null,"in m","in m²"," in m²","in m²",1,"mind.   m³","in m³"]
["Milchkühe",null,null,null,null,null,{"$f":"((C8*(1.5+((((A10+4)*1000-4000)/1000)*(0.25/6))))+(D8*(1.5+((((A10+4)*1000-4000)/1000)*(0.25/6))))*0.55)*IF(C9=\"\",(G7+5),IF(C9/30>(G7+5),(G7+5),C9/30))","v":0},{"$f":"(F8*VLOOKUP(A10,B55:I62,3)*VLOOKUP(H7,A92:B97,2)+E8*VLOOKUP(A10,B55:I62,IF(H7<3,3,5))+D8*VLOOKUP(A10,B55:I62,IF(H7<3,3,5))*0.45)*IF(H7=1,H7*1.1,H7)","v":0},null,null,null,null,null,{"$f":"IF(K8>0,K8*$L$4*($N$7+2)*30/360*0.7/1000/2+M8*$L$4*($N$7+2)*30/360*0.7/1000,\"\")","v":""},{"$f":"IF(L8=0,0,IF(J8*L8*0.03>3,J8*L8*0.03,3))","v":0},null,{"$f":"L8*J8","v":0}]
[null,{"$f":"IF(C8+D8+E8+F8=B8,\"Tage Stall:\",(C8+D8+E8+F8-B8))","v":"Tage Stall:"},null,null,null,1,{"$f":"IF(F9=1,F8*VLOOKUP(A10,B55:I62,4)*IF(C9=\"\",(G7+5),IF(C9/30>(G7+5),(G7+5),C9/30)),F8*VLOOKUP(A10,B55:I62,4)*IF(C9=\"\",(G7+5)/2,IF(C9/30>(G7+5),(G7+5)/2,C9/30/2)))","v":0},null,null,null,null,null,null,"",{"$f":"IF(L9=0,0,IF(J9*L9*0.03>3,J9*L9*0.03,3))","v":0},null,{"$f":"L9*J9","v":0}]
[10,null,"Melkabwasser in Gülle einleiten ?",null,null,1,{"$f":"IF(F10=1,(C8+D8+E8+F8)*8.5*30/1000*(G7+5),0)","v":0},null,null,null,null,null,null,"",0,null,0]
["trag. Färsen",null,null,null,null,null,{"$f":"(C11*I66+D11*H66)*IF(C12=\"\",(G7+5),IF(C12/30>(G7+5),(G7+5),C12/30))","v":0},{"$f":"(D11*IF($H$7<3,D66*0.45,G66)+E11*IF($H$7<3,D66,F66)+F11*D66*VLOOKUP(H7,A92:B97,2))*IF($H$7=1,$H$7*1.1,$H$7)","v":0},null,null,null,null,null,"",0,null,0]
["über 2 Jahre",{"$f":"IF(C11+D11+E11+F11=B11,\"Tage Stall:\",(C11+D11+E11+F11-B11))","v":"Tage Stall:"},null,null,null,1,{"$f":"IF(F12=2,F11*E66/2,F11*E66)*IF(C12=\"\",(G7+5),IF(C12/30>(G7+5),(G7+5),C12/30))","v":0},null,null,null,null,null,null,"",{"$f":"IF(L12=0,0,IF(J12*L12*0.03>3,J12*L12*0.03,3))","v":0},null,0]
["Jungrinder ",null,null,null,null,null,{"$f":"(C13*I67+D13*H67)*IF(C14=\"\",(G7+5),IF(C14/30>(G7+5),(G7+5),C14/30))","v":0},{"$f":"(D13*IF($H$7<3,D67*0.45,G67)+E13*IF($H$7<3,D67,F67)+F13*D67*VLOOKUP(H7,A92:B97,2))*IF($H$7=1,$H$7*1.1,$H$7)","v":0},null,null,null,null,null,"",0,null,0]
["1 - 2 Jahre",{"$f":"IF(C13+D13+E13+F13=B13,\"Tage Stall:\",(C13+D13+E13+F13-B13))","v":"Tage Stall:"},null,null,null,1,{"$f":"IF(F14=2,F13*E67/2,F13*E67)*IF(C14=\"\",(G7+5),IF(C14/30>(G7+5),(G7+5),C14/30))","v":0},null,null,null,null,null,null,"",0,null,0]
["Jungrinder",null,null,null,null,null,{"$f":"(C15*I68+D15*H68)*IF(C16=\"\",(G7+5),IF(C16/30>(G7+5),(G7+5),C16/30))","v":0},{"$f":"(D15*IF($H$7<3,D68*0.45,G68)+E15*IF($H$7<3,D68,F68)+F15*D68*VLOOKUP(H7,A92:B97,2))*IF($H$7=1,$H$7*1.1,$H$7)","v":0},"Summe ",null,{"$f":"SUM(K8:K14)","v":0},null,null,{"$f":"SUM(N8:N14)","v":0},{"$f":"SUM(O8:O14)","v":0},null,{"$f":"SUM(Q8:Q14)","v":0}]
["> 6 Mon. - 1 Jahr",{"$f":"IF(C15+D15+E15+F15=B15,\"Tage Stall:\",(C15+D15+E15+F15-B15))","v":"Tage Stall:"},null,null,null,1,{"$f":"IF(F16=2,F15*E68/2,F15*E68)*IF(C16=\"\",(G7+5),IF(C16/30>(G7+5),(G7+5),C16/30))","v":0}]
["Kälber (o.Mastk.)",null,null,null,null,null,{"$f":"(C17*I69+D17*H69)*(G$7+5)","v":0},{"$f":"(D17*IF($H$7<3,D69*0.45,G69)+E17*IF($H$7<3,D69,F69)+F17*D69*VLOOKUP(H7,A92:B97,2))*IF($H$7=1,$H$7*1.1,$H$7)","v":0},"Name Lager","Anzahl","Behälter-","Art der","Untenentn.","Oberfläche","Grundfläche","Höhe","Lagerraum","Behälterh.","Trapez-"]
[" über 3 - 6 Monate",{"$f":"IF(C17+D17+E17+F17=B17,\"\",(C17+D17+E17+F17-B17))","v":""},null,null,null,null,{"$f":"F17*E69*(G$7+5)","v":0},null,"Sickersaftbehälter","Behälter","form","Abdeckung","o. Pumpens.","o. Durchmesser","in m²","in m","netto* in m³","verfügbar","behölter","Regenwasser"]
["Kälber (o.Mastk.)",null,null,null,null,null,{"$f":"(C19*I70+D19*H70)*(G7+5)","v":0},{"$f":"(D19*IF($H$7<3,D70*0.45,G70)+E19*IF($H$7<3,D70,F70)+F19*D70*VLOOKUP(H7,A92:B97,2))*IF($H$7=1,$H$7*1.1,$H$7)","v":0},null,null,1,2,2,null,null,null,{"$f":"J19*IF(K19=1,(N19/2)*(N19/2)*PI()*R19-T19,IF(K19=2,N19*R19-T19,S19-T19))","v":0},{"$f":"IF(P19=0,0,IF(M19=1,P19-0.2,P19-0.2-0.15))","v":0},{"$f":"IF(K19=3,(N19+O19+SQRT(N19*O19))*P19/3-IF(M19=1,N19*0.2,N19*0.2+O19*0.15),0)","v":0},{"$f":"IF(OR(L19=1,P19=\"\"),0,IF(K19=1,(N19/2)*(N19/2)*PI()*$L$4/1000*0.7*2*30/360,N19*$L$4/1000*0.7*2*30/360))","v":0}]
["bis 3 Monate",{"$f":"IF(C19+D19+E19+F19=B19,\"\",(C19+D19+E19+F19-B19))","v":""},null,null,null,null,{"$f":"F19*E70*(G7+5)","v":0},null,null,null,1,2,2,null,null,null,{"$f":"J20*IF(K20=1,(N20/2)*(N20/2)*PI()*R20-T20,IF(K20=2,N20*R20-T20,S20-T20))","v":0},{"$f":"IF(P20=0,0,IF(M20=1,P20-0.2,P20-0.2-0.15))","v":0},{"$f":"IF(K20=3,(N20+O20+SQRT(N20*O20))*P20/3-IF(M20=1,N20*0.2,N20*0.2+O20*0.15),0)","v":0},{"$f":"IF(OR(L20=1,P20=\"\"),0,IF(K20=1,(N20/2)*(N20/2)*PI()*$L$4/1000*0.7*2*30/360,N20*$L$4/1000*0.7*2*30/360))","v":0}]
["Mastrinder (Bullen)",null,null,null,null,null,{"$f":"(C21*I76+D21*H76)*(G7+5)","v":0},{"$f":"(D21*IF($H$7<3,D76*0.45,G76)+E21*IF($H$7<3,D76,F76)+F21*D76*VLOOKUP(H7,A92:B97,2))*IF($H$7=1,$H$7*1.1,$H$7)","v":0},null,null,1,2,2,null,null,null,0,0,0,0]
["> 2 Jahre",{"$f":"IF(C21+D21+E21+F21=B21,\"\",(C21+D21+E21+F21-B21))","v":""},null,null,null,1,{"$f":"IF(F22=2,F21*E76/2,F21*E76)*(G7+5)","v":0},null,null,null,1,2,2,null,null,null,0,0,0,0]
["Mastrinder",null,null,null,null,null,{"$f":"(C23*I75+D23*H75)*(G7+5)","v":0},{"$f":"(D23*IF($H$7<3,D75*0.45,G75)+E23*IF($H$7<3,D75,F75)+F23*D75*VLOOKUP(H7,A92:B97,2))*IF($H$7=1,$H$7*1.1,$H$7)","v":0},null,null,1,2,2,null,null,null,0,0,0,0]
["1-2Jahre",{"$f":"IF(C23+D23+E23+F23=B23,\"\",(C23+D23+E23+F23-B23))","v":""},null,null,null,1,{"$f":"IF(F24=2,F23*E75/2,F23*E75)*(G7+5)","v":0},null,null,null,1,2,2,null,null,null,0,0,0,0]
["Mastrinder",null,null,null,null,null,{"$f":"(C25*I74+D25*H74)*(G7+5)","v":0},{"$f":"(D25*IF($H$7<3,D74*0.45,G74)+E25*IF($H$7<3,D74,F74)+F25*D74*VLOOKUP(H7,A92:B97,2))*IF($H$7=1,$H$7*1.1,$H$7)","v":0},null,null,1,2,2,null,null,null,0,0,0,0]
["6 Mon.- 1 Jahr",{"$f":"IF(C25+D25+E25+F25=B25,\"\",(C25+D25+E25+F25-B25))","v":""},null,null,null,1,{"$f":"IF(F26=2,F25*E74/2,F25*E74)*(G7+5)","v":0},null,"Summe ",{"$f":"SUM(J19:J25)","v":0},null,null,null,null,null,null,{"$f":"SUM(Q19:Q25)","v":0}]
["Mastkälber",null,null,null,null,null,{"$f":"(C27*I73+D27*H73)*(G7+5)/IF(C28=1,2,1)","v":0},{"$f":"(D27*IF($H$7<3,D73*0.45,G73)+E27*IF($H$7<3,D73,F73)+F27*D73*VLOOKUP(H7,A92:B97,2))*IF($H$7=1,$H$7*1.1,$H$7)","v":0}]
[" über 3 - 6 Monate",{"$f":"IF(C27+D27+E27+F27=B27,\"\",(C27+D27+E27+F27-B27))","v":""},2,null,null,1,{"$f":"IF(F28=2,F27*E73/2,F27*E73)*(G7+5)","v":0},null,"Die Lagerkapazität für Silosickersaft beträgt :",null,null,null,{"$f":"IF(Q15=0,\"\",Q26/Q15)","v":""},"des gleichzeitig befüllten Siloraumes"]
["Mastkälber ",null,null,null,null,null,{"$f":"(C29*I72+D29*H72)*(G7+5)/IF(C30=1,2,1)","v":0},{"$f":"(D29*IF($H$7<3,D72*0.45,G72)+E29*IF($H$7<3,D72,F72)+F29*D72*VLOOKUP(H7,A92:B97,2))*IF($H$7=1,$H$7*1.1,$H$7)","v":0},"dies entspricht :",null,null,null,{"$f":"IF(Q26>0,Q26/((N15+O15)/((N7+2)*30)),\"\")","v":""},"Tagen =",null,{"$f":"IF(M29=\"\",\"\",M29/30)","v":""},"Monaten"]
["bis 3 Monate",{"$f":"IF(C29+D29+E29+F29=B29,\"\",(C29+D29+E29+F29-B29))","v":""},2,null,null,null,{"$f":"F29*E72*(G7+5)","v":0}]
["Rosa-Kalbfleisch",null,null,null,null,null,{"$f":"(C31*I78+D31*H78)*(G$7+5)","v":0},{"$f":"(D31*IF($H$7<3,D78*0.45,G78)+E31*IF($H$7<3,D78,F78)+F31*D78*VLOOKUP(H7,A92:B97,2))*IF($H$7=1,$H$7*1.1,$H$7)","v":0},"Kommentar:"]
["50 - 350 kg",null,null,null,null,null,{"$f":"F31*E78*(G$7+5)","v":0}]
["Fresseraufzucht",null,null,null,null,null,{"$f":"(C33*I79+D33*H79)*(G$7+5)","v":0},{"$f":"(D33*IF($H$7<3,D79*0.45,G79)+E33*IF($H$7<3,D79,F79)+F33*D79*VLOOKUP(H7,A92:B97,2))*IF($H$7=1,$H$7*1.1,$H$7)","v":0}]
["80 - 210 kg",null,null,null,null,null,{"$f":"F33*E79*(G$7+5)","v":0}]
["Mutter-/Ammen- ",null,null,null,null,null,{"$f":"IF(B36=1,(C35*I81+D35*H81)*IF(E36=\"\",(G7+5),IF(E36/30>(G7+5),(G7+5),(E36/30))),(C35*I83+D35*H83)*IF(E36=\"\",(G7+5),IF(E36/30>(G7+5),(G7+5),(E36/30))))","v":0},{"$f":"IF(B36=1,(D35*IF(H7<3,D81*0.45,G81)+E35*IF(H7<3,D81,F81)+F35*D81*VLOOKUP(H7,A92:B97,2)),(D35*IF(H7<3,D83*0.45,G83)+E35*IF(H7<3,D83,F83)+F35*D83*VLOOKUP(H7,A92:B97,2)))*IF(H7=1,H7*1.1,H7)","v":0}]
["Kühe, 500 kg",1,"Anz. Tage Stallhaltung:",null,null,1,{"$f":"IF(B36=1,IF(F36=2,F35*E81/2,F35*E81),IF(F36=2,F35*E83/2,F35*E83))*IF(E36=\"\",(G7+5),IF(E36/30>(G7+5),(G7+5),(E36/30)))","v":0}]
["Mutter-/Ammen- ",null,null,null,null,null,{"$f":"IF(B38=1,(C37*I82+D37*H82)*IF(E38=\"\",(G7+5),IF(E38/30>(G7+5),(G7+5),(E38/30))),(C37*I84+D37*H84)*IF(E38=\"\",(G7+5),IF(E38/30>(G7+5),(G7+5),(E38/30))))","v":0},{"$f":"IF(B38=1,(D37*IF(H7<3,D82*0.45,G82)+E37*IF(H7<3,D82,F82)+F37*D82*VLOOKUP(H7,A92:B97,2)),(D37*IF(H7<3,D84*0.45,G84)+E37*IF(H7<3,D84,F84)+F37*D84*VLOOKUP(H7,A92:B97,2)))*IF(H7=1,H7*1.1,H7)","v":0}]
["Kühe, 700 kg",1,"Anz. Tage Stallhaltung:",null,null,1,{"$f":"IF(B38=1,IF(F38=2,F37*E82/2,F37*E82),IF(F38=2,F37*E84/2,F37*E84))*IF(E38=\"\",(G7+5),IF(E38/30>(G7+5),(G7+5),(E38/30)))","v":0}]
["alle Bereiche"," zusätzl. Reinigungswasser (Liter/Tag)",null,null,null,null,{"$f":"F39*30/1000*(G7+5)","v":0}]
["Summe Rinder",{"$f":"SUM(B37,B35,B29,B27,B25,B23,B21,B19,B17,B15,B13,B11,B8)","v":0},null,null,null,null,{"$f":"SUM(G8:G39)","v":0},{"$f":"SUM(H37,H35,H29,H27,H25,H23,H21,H19,H17,H15,H13,H11,H8)","v":0}]
["Kommentar:"]
[]
[]
[]
[]
[]
[]
[]
[]
[null,null,null,"Flachlauf-, ",null,"Tiefstreustall ","Tiefstreustall ",null,"Laufstall, "]
[null,null,null,null,null,"ohne sep.","mit sep. 55%",null,"Anbindestall "]
[null,null,null,"Anbindestall ",null,"Freßbereich","Freßbereich"]
["Rinder",null,"Frischmist","Frischmist"]
[null,null,"t/Tier","m³/Tier","Jauche","Dung","Dung","Gülle","Gülle"]
["Milchkuh 5000 Liter",1,1.1499999999999999,1.39,0.49,1.18,0.53,0.85,1.54]
["Milchkuh 6000 Liter",2,1.2,1.45,0.5,1.19,0.54,0.87,1.58]
["Milchkuh 7000 Liter",3,1.23,1.48,0.51,1.2,0.54,0.89,1.62]
["Milchkuh 8000 Liter",4,1.25,1.51,0.53,1.21,0.54,0.92,1.67]
["Milchkuh 9000 Liter",5,1.32,1.59,0.55000000000000004,1.22,0.55000000000000004,0.94,1.71]
["Milchkuh 10000 Liter",6,1.33,1.6,0.56999999999999995,1.23,0.55000000000000004,0.96,1.75]
["Milchkuh 11000 Liter",7,1.37,1.65,0.57999999999999996,1.24,0.56000000000000005,0.98,1.79]
["Milchkuh 12000 Liter",8,1.42,1.71,0.6,1.25,0.56000000000000005,1.01,1.84]
["Milchkuh 13000 Liter",9,1.46,1.76,0.62,1.26,0.56999999999999995,1.03,1.88]
["Milchkuh 14000 Liter",10,1.5,1.81,0.63,1.27,0.56999999999999995,1.06,1.92]
["Melkhausabwasser",null,null,null,null,null,null,null,0.255]
["Färsen über 2 Jahre",1,1.03,1.24,0.38,0.96,0.43,0.73,1.32]
["Jungrinder 1-2 Jahre",0.7,0.85,1.02,0.27,0.77,0.35,0.55000000000000004,1]
["Jungrinder >6 Monate-1Jahr",0.43,0.52,0.63,0.13,0.47,0.21,0.31,0.56000000000000005]
["Kälber 3-6 Monate",0.25,0.34,0.41,0.05,0.31,0.14000000000000001,0.19,0.35]
["Kälber 0-3 Monate",0.14000000000000001,0.26,0.31,0.03,0.23,0.1,0.12,0.21]
[]
["Mastkälber unter 3 Monaten",0.2,0.22,0.27,7.0000000000000007E-2,0.21,0.09,0.22,0.4]
["Mastkälber 3- 6 Monate",0.33,0.23,0.28000000000000003,0.11,0.22,0.1,0.27,0.5]
[" Männliche Rinder über 6 Monate bis 1 Jahr",0.6,0.38,0.46,0.24,0.4,0.18,0.35,0.63]
[" Männliche Rinder über 1 Jahr bis 2 Jahre",1,0.5,0.6,0.42,0.52,0.23,0.41,0.74]
[" Männliche Rinder über 2 Jahre (einschl. Zuchtbullen)",1.2,0.64,0.77,0.45,0.67,0.3,0.55000000000000004,1]
[]
["Rosa-Kalbfleisch",0.4,0.3,0.36,0.04,0.27,0.12,0.18,0.33]
["Fresseraufzucht",0.28999999999999998,0.38,0.46,0.04,0.35,0.16,0.25,0.46]
[]
[" Mutter- und Ammenkühe m.0,9 Kalb",null,1,1.2,0.46,1,0.45,0.73,1.33]
[" Mutter- und Ammenkühe m.0,9 Kalb",null,1.32,1.59,0.5,1.35,0.6,0.92,1.67]
[" Mutter- und Ammenkühe",1.2,0.73,0.88,0.42,0.74,0.33,0.62,1.1299999999999999]
[" Mutter- und Ammenkühe",1.2,1.05,1.27,0.46,1.1000000000000001,0.5,0.8,1.46]
[]
[null,"500 kg","Frischmist","ja","33 Tage",5000,"Rundbeh."]
[null,"700 kg","Tiefstreu","nein","2 Monate",6000,"Rechteckbeh."]
[null,null,null,null,"3 Monate",7000,"Re.-Trapez."]
[null,"Milchmast",null,{"$f":"IF(D6=1,\"Flachstreu\",\"FB Gülle\")","v":"FB Gülle"},"4 Monate",8000]
[null,"Weitermast",null,{"$f":"IF(D6=1,\"Tretmist\",\"FB Mist\")","v":"FB Mist"},"5 Monate",9000,"wasserdicht"]
[null,null,null,{"$f":"IF(D6=1,\"Teiltiefstreu\",\"o.sep. FB\")","v":"o.sep. FB"},"6 Monate",10000,"wasserdurchl."]
[1,1,null,null,"7 Monate",11000]
[2,1,"0,9 Kalb",null,"8 Monate",12000,"ja"]
[3,0.86599999999999999,"ohne Kalb",null,"9 Monate",13000,"nein"]
[4,0.8,null,null,"10 Monate",14000]
[5,0.76,null,null,"11 Monate"]
[6,0.73,null,null,"12 Monate"]
[]
[]
[null,null,null,null,"Flachstreu"]
[null,null,null,null,"Tretmist"]
[]
[]
[]
[]
[]
[]
[]
[]
[]
[]
[]
[]
[]
[]
[]
[]
[]
[]
[]
[]
[]
[]
[]
[]
[]
[]
[]
[]
[]
[]
[]
[]
[]
[]
[]
[]
[]
[]
[]
[]
[]
[]
[]
[]
[]
[]
[]
[]
[]
[]
[]
[]
[]
[]
[]
[]
[]
[]
[]
[]
[]
[]
[]
[]
[]
[]
[]
[]
[]
[]
[]
[]
[]
[]
[]
[]
[]
[]
[]
[]
[]
[]
[]
[]
[]
[]
[]
[]
[]
[]
[]
[]
[]
[]
[]
[]
[]
[]
[]
[]
[]
[]
[]
[]
[]
[]
[]
[]
[]
[]
[]
[]
[]
[]
[]
[]
[]
[]
[]
[]
[]
[]
[]
[]
[]
[]
[]
[]
[]
[]
[]
[]
[]
[]
[]
[]
[]
[]
[]
[]
[]
[]
[]
[]
[]
[]
[]
[]
[]
[]
[]
[]
[]
[]
[]
[]
[]
[]
[]
[]
[]
[]
[]
[]
[]
[]
[]
[]
[]
[]
[]
[]
[]
[]
[]
[]
[]
[]
[]
[]
[]
[]
[]
[]
[]
[]
[]
[]
[]
[]
[]
[]
[]
[]
[]
[]
[]
[]
[]
[]
[]
[]
[]
[]
[]
[]
[]
[]
[]
[]
[]
[]
[]
[]
[]
[]
[]
[]
[]
[]
[]
[]
[]
[]
[]
[]
[]
[]
[]
[]
[]
[]
[]
[]
[]
[]
[]
[]
[]
[]
[]
[]
[]
[]
[]
[]
[]
[]
[]
[]
[]
[]
[]
[]
[]
[]
[]
[]
[]
[]
[]
[]
[]
[]
[]
[]
[]
[]
[]
[]
[]
[]
[]
[]
[]
[]
[]
[]
[]
[]
[]
[]
[]
[]
[]
[]
[]
[]
[]
[]
[]
[]
[]
[]
[]
[]
[]
[]
[]
[]
[]
[]
[]
[]
[]
[]
[]
[]
[]
[]
[]
[]
[]
[]
[]
[]
[]
[]
[]
[]
[]
[]
[]
[]
[]
[]
[]
[]
[]
[]
[]
[]
[]
[]
[]
[]
[]
[]
[]
[]
[]
[]
[]
[]
[]
[]
[]
[]
[]
[]
[]
[]
[]
[]
[]
[]
[]
[]
[]
[]
[]
[]
[]
[]
[]
[]
[]
[]
[]
[]
[]
[]
[]
[]
[]
[]
[]
[]
[]
[]
[]
[]
[]
[]
[]
[]
[]
[]
[]
[]
[]
[]
[]
[]
[]
[]
[]
[]
[]
[]
[]
[]
[]
[]
[]
[]
[]
[]
[]
[]
[]
[]
[]
[]
[]
[]
[]
[]
[]
[]
[]
[]
[]
[]
[]
[]
[]
[]
[]
[]
[]
[]
[]
[]
[]
[]
[]
[]
[]
[]
[]
[]
[]
[]
[]
[]
[]
[]
[]
[]
[]
[]
[]
[]
[]
[]
[]
[]
[]
[]
[]
[]
[]
[]
[]
[]
[]
[]
[]
[]
[]
[]
[]
[]
[]
[]
[]
[]
[]
[]
[]
[]
[]
[]
[]
[]
[]
[]
[]
[]
[]
[]
[]
[]
[]
[]
[]
[]
[]
[]
[]
[]
[]
[]
[]
[]
[]
[]
[]
[]
[]
[]
[]
[]
[]
[]
[]
[]
[]
[]
[]
[]
[]
[]
[]
[]
[]
[]
[]
[]
[]
[]
[]
[]
[]
[]
[]
[]
[]
[]
[]
[]
[]
[]
[]
[]
[]
[]
[]
[]
[]
[]
[]
[]
[]
[]
[]
[]
[]
[]
[]
[]
[]
[]
[]
[]
[]
[]
[]
[]
[]
[]
[]
[]
[]
[]
[]
[]
[]
[]
[]
[]
[]
[]
[]
[]
[]
[]
[]
[]
[]
[]
[]
[]
[]
[]
[]
[]
[]
[]
[]
[]
[]
[]
[]
[]
[]
[]
[]
[]
[]
[]
[]
[]
[]
[]
[]
[]
[]
[]
[]
[]
[]
[]
[]
[]
[]
[]
[]
[]
[]
[]
[]
[]
[]
[]
[]
[]
[]
[]
[]
[]
[]
[]
[]
[]
[]
[]
[]
[]
[]
[]
[]
[]
[]
[]
[]
[]
[]
[]
[]
[]
[]
[]
[]
[]
[]
[]
[]
[]
[]
[]
[]
[]
[]
[]
[]
[]
[]
[]
[]
[]
[]
[]
[]
[]
[]
[]
[]
[]
[]
[]
[]
[]
[]
[]
[]
[]
[]
[]
[]
[]
[]
[]
[]
[]
[]
[]
[]
[]
[]
[]
[]
[]
[]
[]
[]
[]
[]
[]
[]
[]
[]
[]
[]
[]
[]
[]
[]
[]
[]
[]
[]
[]
[]
[]
[]
[]
[]
[]
[]
[]
[]
[]
[]
[]
[]
[]
[]
[]
[]
[]
[]
[]
[]
[]
[]
[]
[]
[]
[]
[]
[]
[]
[]
[]
[]
[]
[]
[]
[]
[]
[]
[]
[]
[]
[]
[]
[]
[]
[]
[]
[]
[]
[]
[]
[]
[]
[]
[]
[]
[]
[]
[]
[]
[]
[]
[]
[]
[]
[]
[]
[]
[]
[]
[]
[]
[]
[]
[]
[]
[]
[]
[]
[]
[]
[]
[]
[]
[]
[]
[]
[]
[]
[]
[]
[]
[]
[]
[]
[]
[]
[]
[]
[]
[]
[]
[]
[]
[]
[]
[]
[]
[]
[]
[]
[]
[]
[]
[]
[]
[]
[]
[]
[]
[]
[]
[]
[]
[]
[]
[]
[]
[]
[]
[]
[]
[]
[]
[]
[]
[]
[]
[]
[]
[]
[]
[]
[]
[]
[]
[]
[]
[]
[]
[]
[]
[]
[]
[]
[]
[]
[]
[]
[]
[]
[]
[]
[]
[]
[]
[]
[]
[]
[]
[]
[]
[]
[]
[]
[]
[]
[]
[]
[]
[]
[]
[]
[]
[]
[]
[]
[]
[]
[]
[]
[]
[]
[]
[]
[]
[]
[]
[]
[]
[]
[]
[]
[]
[]
[]
[]
[]
[]
[]
[]
[]
[]
[]
[]
[]
[]
[]
[]
[]
[]
[]
[]
[]
[]
[]
[]
[]
[]
[]
[]
[]
[]
[]
[]
[]
[]
[]
[]
[]
[]
[]
[]
[]
[]
[]
[]
[]
[]
[]
[]
[]
[]
[]
[]
[]
[]
[]
[]
[]
[]
[]
[]
[]
[]
[]
[]
[]
[]
[]
[]
[]
[]
[]
[]
[]
[]
[]
[]
[]
[]
[]
[]
[]
[]
[]
[]
[]
[]
[]
[]
[]
[]
[]
[]
[]
[]
[]
[]
[]
[]
[]
[]
[]
[]
[]
[]
[]
[]
[]
[]
[]
[]
[]
[]
[]
[]
[]
[]
[]
[]
[]
[]
[]
[]
[]
[]
[]
[]
[]
[]
[]
[]
[]
[]
[]
[]
[]
[]
[]
[]
[]
[]
[]
[]
[]
[]
[]
[]
[]
[]
[]
[]
[]
[]
[]
[]
[]
[]
[]
[]
[]
[]
[]
[]
[]
[]
[]
[]
[]
[]
[]
[]
[]
[]
[]
[]
[]
[]
[]
[]
[]
[]
[]
[]
[]
[]
[]
[]
[]
[]
[]
[]
[]
[]
[]
[]
[]
[]
[]
[]
[]
[]
[]
[]
[]
[]
[]
[]
[]
[]
[]
[]
[]
[]
[]
[]
[]
[]
[]
[]
[]
[]
[]
[]
[]
[]
[]
[]
[]
[]
[]
[]
[]
[]
[]
[]
[]
[]
[]
[]
[]
[]
[]
[]
[]
[]
[]
[]
[]
[]
[]
[]
[]
[]
[]
[]
[]
[]
[]
[]
[]
[]
[]
[]
[]
[]
[]
[]
[]
[]
[]
[]
[]
[]
[]
[]
[]
[]
[]
[]
[]
[]
[]
[]
[]
[]
[]
[]
[]
[]
[]
[]
[]
[]
[]
[]
[]
[]
[]
[]
[]
[]
[]
[]
[]
[]
[]
[]
[]
[]
[]
[]
[]
[]
[]
[]
[]
[]
[]
[]
[]
[]
[]
[]
[]
[]
[]
[]
[]
[]
[]
[]
[]
[]
[]
[]
[]
[]
[]
[]
[]
[]
[]
[]
[]
[]
[]
[]
[]
[]
[]
[]
[]
[]
[]
[]
[]
[]
[]
[]
[]
[]
[]
[]
[]
[]
[]
[]
[]
[]
[]
[]
[]
[]
[]
[]
[]
[]
[]
[]
[]
[]
[]
[]
[]
[]
[]
[]
[]
[]
[]
[]
[]
[]
[]
[]
[]
[]
[]
[]
[]
[]
[]
[]
[]
[]
[]
[]
[]
[]
[]
[]
[]
[]
[]
[]
[]
[]
[]
[]
[]
[]
[]
[]
[]
[]
[]
[]
[]
[]
[]
[]
[]
[]
[]
[]
[]
[]
[]
[]
[]
[]
[]
[]
[]
[]
[]
[]
[]
[]
[]
[]
[]
[]
[]
[]
[]
[]
[]
[]
[]
[]
[]
[]
[]
[]
[]
[]
[]
[]
[]
[]
[]
[]
[]
[]
[]
[]
[]
[]
[]
[]
[]
[]
[]
[]
[]
[]
[]
[]
[]
[]
[]
[]
[]
[]
[]
[]
[]
[]
[]
[]
[]
[]
[]
[]
[]
[]
[]
[]
[]
[]
[]
[]
[]
[]
[]
[]
[]
[]
[]
[]
[]
[]
[]
[]
[]
[]
[]
[]
[]
[]
[]
[]
[]
[]
[]
[]
[]
[]
[]
[]
[]
[]
[]
[]
[]
[]
[]
[]
[]
[]
[]
[]
[]
[]
[]
[]
[]
[]
[]
[]
[]
[]
[]
[]
[]
[]
[]
[]
[]
[]
[]
[]
[]
[]
[]
[]
[]
[]
[]
[]
[]
[]
[]
[]
[]
[]
[]
[]
[]
[]
[]
[]
[]
[]
[]
[]
[]
[]
[]
[]
[]
[]
[]
[]
[]
[]
[]
[]
[]
[]
[]
[]
[]
[]
[]
[]
[]
[]
[]
[]
[]
[]
[]
[]
[]
[]
[]
[]
[]
[]
[]
[]
[]
[]
[]
[]
[]
[]
[]
[]
[]
[]
[]
[]
[]
[]
[]
[]
[]
[]
[]
[]
[]
[]
[]
[]
[]
[]
[]
[]
[]
[]
[]
[]
[]
[]
[]
[]
[]
[]
[]
[]
[]
[]
[]
[]
[]
[]
[]
[]
[]
[]
[]
[]
[]
[]
[]
[]
[]
[]
[]
[]
[]
[]
[]
[]
[]
[]
[]
[]
[]
[]
[]
[]
[]
[]
[]
[]
[]
[]
[]
[]
[]
[]
[]
[]
[]
[]
[]
[]
[]
[]
[]
[]
[]
[]
[]
[]
[]
[]
[]
[]
[]
[]
[]
[]
[]
[]
[]
[]
[]
[]
[]
[]
[]
[]
[]
[]
[]
[]
[]
[]
[]
[]
[]
[]
[]
[]
[]
[]
[]
[]
[]
[]
[]
[]
[]
[]
[]
[]
[]
[]
[]
[]
[]
[]
[]
[]
[]
[]
[]
[]
[]
[]
[]
[]
[]
[]
[]
[]
[]
[]
[]
[]
[]
[]
[]
[]
[]
[]
[]
[]
[]
[]
[]
[]
[]
[]
[]
[]
[]
[]
[]
[]
[]
[]
[]
[]
[]
[]
[]
[]
[]
[]
[]
[]
[]
[]
[]
[]
[]
[]
[]
[]
[]
[]
[]
[]
[]
[]
[]
[]
[]
[]
[]
[]
[]
[]
[]
[]
[]
[]
[]
[]
[]
[]
[]
[]
[]
[]
[]
[]
[]
[]
[]
[]
[]
[]
[]
[]
[]
[]
[]
[]
[]
[]
[]
[]
[]
[]
[]
[]
[]
[]
[]
[]
[]
[]
[]
[]
[]
[]
[]
[]
[]
[]
[]
[]
[]
[]
[]
[]
[]
[]
[]
[]
[]
[]
[]
[]
[]
[]
[]
[]
[]
[]
[]
[]
[]
[]
[]
[]
[]
[]
[]
[]
[]
[]
[]
[]
[]
[]
[]
[]
[]
[]
[]
[]
[]
[]
[]
[]
[]
[]
[]
[]
[]
[]
[]
[]
[]
[]
[]
[]
[]
[]
[]
[]
[]
[]
[]
[]
[]
[]
[]
[]
[]
[]
[]
[]
[]
[]
[]
[]
[]
[]
[]
[]
[]
[]
[]
[]
[]
[]
[]
[]
[]
[]
[]
[]
[]
[]
[]
[]
[]
[]
[]
[]
[]
[]
[]
[]
[]
[]
[]
[]
[]
[]
[]
[]
[]
[]
[]
[]
[]
[]
[]
[]
[]
[]
[]
[]
[]
[]
[]
[]
[]
[]
[]
[]
[]
[]
[]
[]
[]
[]
[]
[]
[]
[]
[]
[]
[]
[]
[]
[]
[]
[]
[]
[]
[]
[]
[]
[]
[]
[]
[]
[]
[]
[]
[]
[]
[]
[]
[]
[]
[]
[]
[]
[]
[]
[]
[]
[]
[]
[]
[]
[]
[]
[]
[]
[]
[]
[]
[]
[]
[]
[]
[]
[]
[]
[]
[]
[]
[]
[]
[]
[]
[]
[]
[]
[]
[]
[]
[]
[]
[]
[]
[]
[]
[]
[]
[]
[]
[]
[]
[]
[]
[]
[]
[]
[]
[]
[]
[]
[]
[]
[]
[]
[]
[]
[]
[]
[]
[]
[]
[]
[]
[]
[]
[]
[]
[]
[]
[]
[]
[]
[]
[]
[]
[]
[]
[]
[]
[]
[]
[]
[]
[]
[]
[]
[]
[]
[]
[]
[]
[]
[]
[]
[]
[]
[]
[]
[]
[]
[]
[]
[]
[]
[]
[]
[]
[]
[]
[]
[]
[]
[]
[]
[]
[]
[]
[]
[]
[]
[]
[]
[]
[]
[]
[]
[]
[]
[]
[]
[]
[]
[]
[]
[]
[]
[]
[]
[]
[]
[]
[]
[]
[]
[]
[]
[]
[]
[]
[]
[]
[]
[]
[]
[]
[]
[]
[]
[]
[]
[]
[]
[]
[]
[]
[]
[]
[]
[]
[]
[]
[]
[]
[]
[]
[]
[]
[]
[]
[]
[]
[]
[]
[]
[]
[]
[]
[]
[]
[]
[]
[]
[]
[]
[]
[]
[]
[]
[]
[]
[]
[]
[]
[]
[]
[]
[]
[]
[]
[]
[]
[]
[]
[]
[]
[]
[]
[]
[]
[]
[]
[]
[]
[]
[]
[]
[]
[]
[]
[]
[]
[]
[]
[]
[]
[]
[]
[]
[]
[]
[]
[]
[]
[]
[]
[]
[]
[]
[]
[]
[]
[]
[]
[]
[]
[]
[]
[]
[]
[]
[]
[]
[]
[]
[]
[]
[]
[]
[]
[]
[]
[]
[]
[]
[]
[]
[]
[]
[]
[]
[]
[]
[]
[]
[]
[]
[]
[]
[]
[]
[]
[]
[]
[]
[]
[]
[]
[]
[]
[]
[]
[]
[]
[]
[]
[]
[]
[]
[]
[]
[]
[]
[]
[]
[]
[]
[]
[]
[]
[]
[]
[]
[]
[]
[]
[]
[]
[]
[]
[]
[]
[]
[]
[]
[]
[]
[]
[]
[]
[]
[]
[]
[]
[]
[]
[]
[]
[]
[]
[]
[]
[]
[]
[]
[]
[]
[]
[]
[]
[]
[]
[]
[]
[]
[]
[]
[]
[]
[]
[]
[]
[]
[]
[]
[]
[]
[]
[]
[]
[]
[]
[]
[]
[]
[]
[]
[]
[]
[]
[]
[]
[]
[]
[]
[]
[]
[]
[]
[]
[]
[]
[]
[]
[]
[]
[]
[]
[]
[]
[]
[]
[]
[]
[]
[]
[]
[]
[]
[]
[]
[]
[]
[]
[]
[]
[]
[]
[]
[]
[]
[]
[]
[]
[]
[]
[]
[]
[]
[]
[]
[]
[]
[]
[]
[]
[]
[]
[]
[]
[]
[]
[]
[]
[]
[]
[]
[]
[]
[]
[]
[]
[]
[]
[]
[]
[]
[]
[]
[]
[]
[]
[]
[]
[]
[]
[]
[]
[]
[]
[]
[]
[]
[]
[]
[]
[]
[]
[]
[]
[]
[]
[]
[]
[]
[]
[]
[]
[]
[]
[]
[]
[]
[]
[]
[]
[]
[]
[]
[]
[]
[]
[]
[]
[]
[]
[]
[]
[]
[]
[]
[]
[]
[]
[]
[]
[]
[]
[]
[]
[]
[]
[]
[]
[]
[]
[]
[]
[]
[]
[]
[]
[]
[]
[]
[]
[]
[]
[]
[]
[]
[]
[]
[]
[]
[]
[]
[]
[]
[]
[]
[]
[]
[]
[]
[]
[]
[]
[]
[]
[]
[]
[]
[]
[]
[]
[]
[]
[]
[]
[]
[]
[]
[]
[]
[]
[]
[]
[]
[]
[]
[]
[]
[]
[]
[]
[]
[]
[]
[]
[]
[]
[]
[]
[]
[]
[]
[]
[]
[]
[]
[]
[]
[]
[]
[]
[]
[]
[]
[]
[]
[]
[]
[]
[]
[]
[]
[]
[]
[]
[]
[]
[]
[]
[]
[]
[]
[]
[]
[]
[]
[]
[]
[]
[]
[]
[]
[]
[]
[]
[]
[]
[]
[]
[]
[]
[]
[]
[]
[]
[]
[]
[]
[]
[]
[]
[]
[]
[]
[]
[]
[]
[]
[]
[]
[]
[]
[]
[]
[]
[]
[]
[]
[]
[]
[]
[]
[]
[]
[]
[]
[]
[]
[]
[]
[]
[]
[]
[]
[]
[]
[]
[]
[]
[]
[]
[]
[]
[]
[]
[]
[]
[]
[]
[]
[]
[]
[]
[]
[]
[]
[]
[]
[]
[]
[]
[]
[]
[]
[]
[]
[]
[]
[]
[]
[]
[]
[]
[]
[]
[]
[]
[]
[]
[]
[]
[]
[]
[]
[]
[]
[]
[]
[]
[]
[]
[]
[]
[]
[]
[]
[]
[]
[]
[]
[]
[]
[]
[]
[]
[]
[]
[]
[]
[]
[]
[]
[]
[]
[]
[]
[]
[]
[]
[]
[]
[]
[]
[]
[]
[]
[]
[]
[]
[]
[]
[]
[]
[]
[]
[]
[]
[]
[]
[]
[]
[]
[]
[]
[]
[]
[]
[]
[]
[]
[]
[]
[]
[]
[]
[]
[]
[]
[]
[]
[]
[]
[]
[]
[]
[]
[]
[]
[]
[]
[]
[]
[]
[]
[]
[]
[]
[]
[]
[]
[]
[]
[]
[]
[]
[]
[]
[]
[]
[]
[]
[]
[]
[]
[]
[]
[]
[]
[]
[]
[]
[]
[]
[]
[]
[]
[]
[]
[]
[]
[]
[]
[]
[]
[]
[]
[]
[]
[]
[]
[]
[]
[]
[]
[]
[]
[]
[]
[]
[]
[]
[]
[]
[]
[]
[]
[]
[]
[]
[]
[]
[]
[]
[]
[]
[]
[]
[]
[]
[]
[]
[]
[]
[]
[]
[]
[]
[]
[]
[]
[]
[]
[]
[]
[]
[]
[]
[]
[]
[]
[]
[]
[]
[]
[]
[]
[]
[]
[]
[]
[]
[]
[]
[]
[]
[]
[]
[]
[]
[]
[]
[]
[]
[]
[]
[]
[]
[]
[]
[]
[]
[]
[]
[]
[]
[]
[]
[]
[]
[]
[]
[]
[]
[]
[]
[]
[]
[]
[]
[]
[]
[]
[]
[]
[]
[]
[]
[]
[]
[]
[]
[]
[]
[]
[]
[]
[]
[]
[]
[]
[]
[]
[]
[]
[]
[]
[]
[]
[]
[]
[]
[]
[]
[]
[]
[]
[]
[]
[]
[]
[]
[]
[]
[]
[]
[]
[]
[]
[]
[]
[]
[]
[]
[]
[]
[]
[]
[]
[]
[]
[]
[]
[]
[]
[]
[]
[]
[]
[]
[]
[]
[]
[]
[]
[]
[]
[]
[]
[]
[]
[]
[]
[]
[]
[]
[]
[]
[]
[]
[]
[]
[]
[]
[]
[]
[]
[]
[]
[]
[]
[]
[]
[]
[]
[]
[]
[]
[]
[]
[]
[]
[]
[]
[]
[]
[]
[]
[]
[]
[]
[]
[]
[]
[]
[]
[]
[]
[]
[]
[]
[]
[]
[]
[]
[]
[]
[]
[]
[]
[]
[]
[]
[]
[]
[]
[]
[]
[]
[]
[]
[]
[]
[]
[]
[]
[]
[]
[]
[]
[]
[]
[]
[]
[]
[]
[]
[]
[]
[]
[]
[]
[]
[]
[]
[]
[]
[]
[]
[]
[]
[]
[]
[]
[]
[]
[]
[]
[]
[]
[]
[]
[]
[]
[]
[]
[]
[]
[]
[]
[]
[]
[]
[]
[]
[]
[]
[]
[]
[]
[]
[]
[]
[]
[]
[]
[]
[]
[]
[]
[]
[]
[]
[]
[]
[]
[]
[]
[]
[]
[]
[]
[]
[]
[]
[]
[]
[]
[]
[]
[]
[]
[]
[]
[]
[]
[]
[]
[]
[]
[]
[]
[]
[]
[]
[]
[]
[]
[]
[]
[]
[]
[]
[]
[]
[]
[]
[]
[]
[]
[]
[]
[]
[]
[]
[]
[]
[]
[]
[]
[]
[]
[]
[]
[]
[]
[]
[]
[]
[]
[]
[]
[]
[]
[]
[]
[]
[]
[]
[]
[]
[]
[]
[]
[]
[]
[]
[]
[]
[]
[]
[]
[]
[]
[]
[]
[]
[]
[]
[]
[]
[]
[]
[]
[]
[]
[]
[]
[]
[]
[]
[]
[]
[]
[]
[]
[]
[]
[]
[]
[]
[]
[]
[]
[]
[]
[]
[]
[]
[]
[]
[]
[]
[]
[]
[]
[]
[]
[]
[]
[]
[]
[]
[]
[]
[]
[]
[]
[]
[]
[]
[]
[]
[]
[]
[]
[]
[]
[]
[]
[]
[]
[]
[]
[]
[]
[]
[]
[]
[]
[]
[]
[]
[]
[]
[]
[]
[]
[]
[]
[]
[]
[]
[]
[]
[]
[]
[]
[]
[]
[]
[]
[]
[]
[]
[]
[]
[]
[]
[]
[]
[]
[]
[]
[]
[]
[]
[]
[]
[]
[]
[]
[]
[]
[]
[]
[]
[]
[]
[]
[]
[]
[]
[]
[]
[]
[]
[]
[]
[]
[]
[]
[]
[]
[]
[]
[]
[]
[]
[]
[]
[]
[]
[]
[]
[]
[]
[]
[]
[]
[]
[]
[]
[]
[]
[]
[]
[]
[]
[]
[]
[]
[]
[]
[]
[]
[]
[]
[]
[]
[]
[]
[]
[]
[]
[]
[]
[]
[]
[]
[]
[]
[]
[]
[]
[]
[]
[]
[]
[]
[]
[]
[]
[]
[]
[]
[]
[]
[]
[]
[]
[]
[]
[]
[]
[]
[]
[]
[]
[]
[]
[]
[]
[]
[]
[]
[]
[]
[]
[]
[]
[]
[]
[]
[]
[]
[]
[]
[]
[]
[]
[]
[]
[]
[]
[]
[]
[]
[]
[]
[]
[]
[]
[]
[]
[]
[]
[]
[]
[]
[]
[]
[]
[]
[]
[]
[]
[]
[]
[]
[]
[]
[]
[]
[]
[]
[]
[]
[]
[]
[]
[]
[]
[]
[]
[]
[]
[]
[]
[]
[]
[]
[]
[]
[]
[]
[]
[]
[]
[]
[]
[]
[]
[]
[]
[]
[]
[]
[]
[]
[]
[]
[]
[]
[]
[]
[]
[]
[]
[]
[]
[]
[]
[]
[]
[]
[]
[]
[]
[]
[]
[]
[]
[]
[]
[]
[]
[]
[]
[]
[]
[]
[]
[]
[]
[]
[]
[]
[]
[]
[]
[]
[]
[]
[]
[]
[]
[]
[]
[]
[]
[]
[]
[]
[]
[]
[]
[]
[]
[]
[]
[]
[]
[]
[]
[]
[]
[]
[]
[]
[]
[]
[]
[]
[]
[]
[]
[]
[]
[]
[]
[]
[]
[]
[]
[]
[]
[]
[]
[]
[]
[]
[]
[]
[]
[]
[]
[]
[]
[]
[]
[]
[]
[]
[]
[]
[]
[]
[]
[]
[]
[]
[]
[]
[]
[]
[]
[]
[]
[]
[]
[]
[]
[]
[]
[]
[]
[]
[]
[]
[]
[]
[]
[]
[]
[]
[]
[]
[]
[]
[]
[]
[]
[]
[]
[]
[]
[]
[]
[]
[]
[]
[]
[]
[]
[]
[]
[]
[]
[]
[]
[]
[]
[]
[]
[]
[]
[]
[]
[]
[]
[]
[]
[]
[]
[]
[]
[]
[]
[]
[]
[]
[]
[]
[]
[]
[]
[]
[]
[]
[]
[]
[]
[]
[]
[]
[]
[]
[]
[]
[]
[]
[]
[]
[]
[]
[]
[]
[]
[]
[]
[]
[]
[]
[]
[]
[]
[]
[]
[]
[]
[]
[]
[]
[]
[]
[]
[]
[]
[]
[]
[]
[]
[]
[]
[]
[]
[]
[]
[]
[]
[]
[]
[]
[]
[]
[]
[]
[]
[]
[]
[]
[]
[]
[]
[]
[]
[]
[]
[]
[]
[]
[]
[]
[]
[]
[]
[]
[]
[]
[]
[]
[]
[]
[]
[]
[]
[]
[]
[]
[]
[]
[]
[]
[]
[]
[]
[]
[]
[]
[]
[]
[]
[]
[]
[]
[]
[]
[]
[]
[]
[]
[]
[]
[]
[]
[]
[]
[]
[]
[]
[]
[]
[]
[]
[]
[]
[]
[]
[]
[]
[]
[]
[]
[]
[]
[]
[]
[]
[]
[]
[]
[]
[]
[]
[]
[]
[]
[]
[]
[]
[]
[]
[]
[]
[]
[]
[]
[]
[]
[]
[]
[]
[]
[]
[]
[]
[]
[]
[]
[]
[]
[]
[]
[]
[]
[]
[]
[]
[]
[]
[]
[]
[]
[]
[]
[]
[]
[]
[]
[]
[]
[]
[]
[]
[]
[]
[]
[]
[]
[]
[]
[]
[]
[]
[]
[]
[]
[]
[]
[]
[]
[]
[]
[]
[]
[]
[]
[]
[]
[]
[]
[]
[]
[]
[]
[]
[]
[]
[]
[]
[]
[]
[]
[]
[]
[]
[]
[]
[]
[]
[]
[]
[]
[]
[]
[]
[]
[]
[]
[]
[]
[]
[]
[]
[]
[]
[]
[]
[]
[]
[]
[]
[]
[]
[]
[]
[]
[]
[]
[]
[]
[]
[]
[]
[]
[]
[]
[]
[]
[]
[]
[]
[]
[]
[]
[]
[]
[]
[]
[]
[]
[]
[]
[]
[]
[]
[]
[]
[]
[]
[]
[]
[]
[]
[]
[]
[]
[]
[]
[]
[]
[]
[]
[]
[]
[]
[]
[]
[]
[]
[]
[]
[]
[]
[]
[]
[]
[]
[]
[]
[]
[]
[]
[]
[]
[]
[]
[]
[]
[]
[]
[]
[]
[]
[]
[]
[]
[]
[]
[]
[]
[]
[]
[]
[]
[]
[]
[]
[]
[]
[]
[]
[]
[]
[]
[]
[]
[]
[]
[]
[]
[]
[]
[]
[]
[]
[]
[]
[]
[]
[]
[]
[]
[]
[]
[]
[]
[]
[]
[]
[]
[]
[]
[]
[]
[]
[]
[]
[]
[]
[]
[]
[]
[]
[]
[]
[]
[]
[]
[]
[]
[]
[]
[]
[]
[]
[]
[]
[]
[]
[]
[]
[]
[]
[]
[]
[]
[]
[]
[]
[]
[]
[]
[]
[]
[]
[]
[]
[]
[]
[]
[]
[]
[]
[]
[]
[]
[]
[]
[]
[]
[]
[]
[]
[]
[]
[]
[]
[]
[]
[]
[]
[]
[]
[]
[]
[]
[]
[]
[]
[]
[]
[]
[]
[]
[]
[]
[]
[]
[]
[]
[]
[]
[]
[]
[]
[]
[]
[]
[]
[]
[]
[]
[]
[]
[]
[]
[]
[]
[]
[]
[]
[]
[]
[]
[]
[]
[]
[]
[]
[]
[]
[]
[]
[]
[]
[]
[]
[]
[]
[]
[]
[]
[]
[]
[]
[]
[]
[]
[]
[]
[]
[]
[]
[]
[]
[]
[]
[]
[]
[]
[]
[]
[]
[]
[]
[]
[]
[]
[]
[]
[]
[]
[]
[]
[]
[]
[]
[]
[]
[]
[]
[]
[]
[]
[]
[]
[]
[]
[]
[]
[]
[]
[]
[]
[]
[]
[]
[]
[]
[]
[]
[]
[]
[]
[]
[]
[]
[]
[]
[]
[]
[]
[]
[]
[]
[]
[]
[]
[]
[]
[]
[]
[]
[]
[]
[]
[]
[]
[]
[]
[]
[]
[]
[]
[]
[]
[]
[]
[]
[]
[]
[]
[]
[]
[]
[]
[]
[]
[]
[]
[]
[]
[]
[]
[]
[]
[]
[]
[]
[]
[]
[]
[]
[]
[]
[]
[]
[]
[]
[]
[]
[]
[]
[]
[]
[]
[]
[]
[]
[]
[]
[]
[]
[]
[]
[]
[]
[]
[]
[]
[]
[]
[]
[]
[]
[]
[]
[]
[]
[]
[]
[]
[]
[]
[]
[]
[]
[]
[]
[]
[]
[]
[]
[]
[]
[]
[]
[]
[]
[]
[]
[]
[]
[]
[]
[]
[]
[]
[]
[]
[]
[]
[]
[]
[]
[]
[]
[]
[]
[]
[]
[]
[]
[]
[]
[]
[]
[]
[]
[]
[]
[]
[]
[]
[]
[]
[]
[]
[]
[]
[]
[]
[]
[]
[]
[]
[]
[]
[]
[]
[]
[]
[]
[]
[]
[]
[]
[]
[]
[]
[]
[]
[]
[]
[]
[]
[]
[]
[]
[]
[]
[]
[]
[]
[]
[]
[]
[]
[]
[]
[]
[]
[]
[]
[]
[]
[]
[]
[]
[]
[]
[]
[]
[]
[]
[]
[]
[]
[]
[]
[]
[]
[]
[]
[]
[]
[]
[]
[]
[]
[]
[]
[]
[]
[]
[]
[]
[]
[]
[]
[]
[]
[]
[]
[]
[]
[]
[]
[]
[]
[]
[]
[]
[]
[]
[]
[]
[]
[]
[]
[]
[]
[]
[]
[]
[]
[]
[]
[]
[]
[]
[]
[]
[]
[]
[]
[]
[]
[]
[]
[]
[]
[]
[]
[]
[]
[]
[]
[]
[]
[]
[]
[]
[]
[]
[]
[]
[]
[]
[]
[]
[]
[]
[]
[]
[]
[]
[]
[]
[]
[]
[]
[]
[]
[]
[]
[]
[]
[]
[]
[]
[]
[]
[]
[]
[]
[]
[]
[]
[]
[]
[]
[]
[]
[]
[]
[]
[]
[]
[]
[]
[]
[]
[]
[]
[]
[]
[]
[]
[]
[]
[]
[]
[]
[]
[]
[]
[]
[]
[]
[]
[]
[]
[]
[]
[]
[]
[]
[]
[]
[]
[]
[]
[]
[]
[]
[]
[]
[]
[]
[]
[]
[]
[]
[]
[]
[]
[]
[]
[]
[]
[]
[]
[]
[]
[]
[]
[]
[]
[]
[]
[]
[]
[]
[]
[]
[]
[]
[]
[]
[]
[]
[]
[]
[]
[]
[]
[]
[]
[]
[]
[]
[]
[]
[]
[]
[]
[]
[]
[]
[]
[]
[]
[]
[]
[]
[]
[]
[]
[]
[]
[]
[]
[]
[]
[]
[]
[]
[]
[]
[]
[]
[]
[]
[]
[]
[]
[]
[]
[]
[]
[]
[]
[]
[]
[]
[]
[]
[]
[]
[]
[]
[]
[]
[]
[]
[]
[]
[]
[]
[]
[]
[]
[]
[]
[]
[]
[]
[]
[]
[]
[]
[]
[]
[]
[]
[]
[]
[]
[]
[]
[]
[]
[]
[]
[]
[]
[]
[]
[]
[]
[]
[]
[]
[]
[]
[]
[]
[]
[]
[]
[]
[]
[]
[]
[]
[]
[]
[]
[]
[]
[]
[]
[]
[]
[]
[]
[]
[]
[]
[]
[]
[]
[]
[]
[]
[]
[]
[]
[]
[]
[]
[]
[]
[]
[]
[]
[]
[]
[]
[]
[]
[]
[]
[]
[]
[]
[]
[]
[]
[]
[]
[]
[]
[]
[]
[]
[]
[]
[]
[]
[]
[]
[]
[]
[]
[]
[]
[]
[]
[]
[]
[]
[]
[]
[]
[]
[]
[]
[]
[]
[]
[]
[]
[]
[]
[]
[]
[]
[]
[]
[]
[]
[]
[]
[]
[]
[]
[]
[]
[]
[]
[]
[]
[]
[]
[]
[]
[]
[]
[]
[]
[]
[]
[]
[]
[]
[]
[]
[]
[]
[]
[]
[]
[]
[]
[]
[]
[]
[]
[]
[]
[]
[]
[]
[]
[]
[]
[]
[]
[]
[]
[]
[]
[]
[]
[]
[]
[]
[]
[]
[]
[]
[]
[]
[]
[]
[]
[]
[]
[]
[]
[]
[]
[]
[]
[]
[]
[]
[]
[]
[]
[]
[]
[]
[]
[]
[]
[]
[]
[]
[]
[]
[]
[]
[]
[]
[]
[]
[]
[]
[]
[]
[]
[]
[]
[]
[]
[]
[]
[]
[]
[]
[]
[]
[]
[]
[]
[]
[]
[]
[]
[]
[]
[]
[]
[]
[]
[]
[]
[]
[]
[]
[]
[]
[]
[]
[]
[]
[]
[]
[]
[]
[]
[]
[]
[]
[]
[]
[]
[]
[]
[]
[]
[]
[]
[]
[]
[]
[]
[]
[]
[]
[]
[]
[]
[]
[]
[]
[]
[]
[]
[]
[]
[]
[]
[]
[]
[]
[]
[]
[]
[]
[]
[]
[]
[]
[]
[]
[]
[]
[]
[]
[]
[]
[]
[]
[]
[]
[]
[]
[]
[]
[]
[]
[]
[]
[]
[]
[]
[]
[]
[]
[]
[]
[]
[]
[]
[]
[]
[]
[]
[]
[]
[]
[]
[]
[]
[]
[]
[]
[]
[]
[]
[]
[]
[]
[]
[]
[]
[]
[]
[]
[]
[]
[]
[]
[]
[]
[]
[]
[]
[]
[]
[]
[]
[]
[]
[]
[]
[]
[]
[]
[]
[]
[]
[]
[]
[]
[]
[]
[]
[]
[]
[]
[]
[]
[]
[]
[]
[]
[]
[]
[]
[]
[]
[]
[]
[]
[]
[]
[]
[]
[]
[]
[]
[]
[]
[]
[]
[]
[]
[]
[]
[]
[]
[]
[]
[]
[]
[]
[]
[]
[]
[]
[]
[]
[]
[]
[]
[]
[]
[]
[]
[]
[]
[]
[]
[]
[]
[]
[]
[]
[]
[]
[]
[]
[]
[]
[]
[]
[]
[]
[]
[]
[]
[]
[]
[]
[]
[]
[]
[]
[]
[]
[]
[]
[]
[]
[]
[]
[]
[]
[]
[]
[]
[]
[]
[]
[]
[]
[]
[]
[]
[]
[]
[]
[]
[]
[]
[]
[]
[]
[]
[]
[]
[]
[]
[]
[]
[]
[]
[]
[]
[]
[]
[]
[]
[]
[]
[]
[]
[]
[]
[]
[]
[]
[]
[]
[]
[]
[]
[]
[]
[]
[]
[]
[]
[]
[]
[]
[]
[]
[]
[]
[]
[]
[]
[]
[]
[]
[]
[]
[]
[]
[]
[]
[]
[]
[]
[]
[]
[]
[]
[]
[]
[]
[]
[]
[]
[]
[]
[]
[]
[]
[]
[]
[]
[]
[]
[]
[]
[]
[]
[]
[]
[]
[]
[]
[]
[]
[]
[]
[]
[]
[]
[]
[]
[]
[]
[]
[]
[]
[]
[]
[]
[]
[]
[]
[]
[]
[]
[]
[]
[]
[]
[]
[]
[]
[]
[]
[]
[]
[]
[]
[]
[]
[]
[]
[]
[]
[]
[]
[]
[]
[]
[]
[]
[]
[]
[]
[]
[]
[]
[]
[]
[]
[]
[]
[]
[]
[]
[]
[]
[]
[]
[]
[]
[]
[]
[]
[]
[]
[]
[]
[]
[]
[]
[]
[]
[]
[]
[]
[]
[]
[]
[]
[]
[]
[]
[]
[]
[]
[]
[]
[]
[]
[]
[]
[]
[]
[]
[]
[]
[]
[]
[]
[]
[]
[]
[]
[]
[]
[]
[]
[]
[]
[]
[]
[]
[]
[]
[]
[]
[]
[]
[]
[]
[]
[]
[]
[]
[]
[]
[]
[]
[]
[]
[]
[]
[]
[]
[]
[]
[]
[]
[]
[]
[]
[]
[]
[]
[]
[]
[]
[]
[]
[]
[]
[]
[]
[]
[]
[]
[]
[]
[]
[]
[]
[]
[]
[]
[]
[]
[]
[]
[]
[]
[]
[]
[]
[]
[]
[]
[]
[]
[]
[]
[]
[]
[]
[]
[]
[]
[]
[]
[]
[]
[]
[]
[]
[]
[]
[]
[]
[]
[]
[]
[]
[]
[]
[]
[]
[]
[]
[]
[]
[]
[]
[]
[]
[]
[]
[]
[]
[]
[]
[]
[]
[]
[]
[]
[]
[]
[]
[]
[]
[]
[]
[]
[]
[]
[]
[]
[]
[]
[]
[]
[]
[]
[]
[]
[]
[]
[]
[]
[]
[]
[]
[]
[]
[]
[]
[]
[]
[]
[]
[]
[]
[]
[]
[]
[]
[]
[]
[]
[]
[]
[]
[]
[]
[]
[]
[]
[]
[]
[]
[]
[]
[]
[]
[]
[]
[]
[]
[]
[]
[]
[]
[]
[]
[]
[]
[]
[]
[]
[]
[]
[]
[]
[]
[]
[]
[]
[]
[]
[]
[]
[]
[]
[]
[]
[]
[]
[]
[]
[]
[]
[]
[]
[]
[]
[]
[]
[]
[]
[]
[]
[]
[]
[]
[]
[]
[]
[]
[]
[]
[]
[]
[]
[]
[]
[]
[]
[]
[]
[]
[]
[]
[]
[]
[]
[]
[]
[]
[]
[]
[]
[]
[]
[]
[]
[]
[]
[]
[]
[]
[]
[]
[]
[]
[]
[]
[]
[]
[]
[]
[]
[]
[]
[]
[]
[]
[]
[]
[]
[]
[]
[]
[]
[]
[]
[]
[]
[]
[]
[]
[]
[]
[]
[]
[]
[]
[]
[]
[]
[]
[]
[]
[]
[]
[]
[]
[]
[]
[]
[]
[]
[]
[]
[]
[]
[]
[]
[]
[]
[]
[]
[]
[]
[]
[]
[]
[]
[]
[]
[]
[]
[]
[]
[]
[]
[]
[]
[]
[]
[]
[]
[]
[]
[]
[]
[]
[]
[]
[]
[]
[]
[]
[]
[]
[]
[]
[]
[]
[]
[]
[]
[]
[]
[]
[]
[]
[]
[]
[]
[]
[]
[]
[]
[]
[]
[]
[]
[]
[]
[]
[]
[]
[]
[]
[]
[]
[]
[]
[]
[]
[]
[]
[]
[]
[]
[]
[]
[]
[]
[]
[]
[]
[]
[]
[]
[]
[]
[]
[]
[]
[]
[]
[]
[]
[]
[]
[]
[]
[]
[]
[]
[]
[]
[]
[]
[]
[]
[]
[]
[]
[]
[]
[]
[]
[]
[]
[]
[]
[]
[]
[]
[]
[]
[]
[]
[]
[]
[]
[]
[]
[]
[]
[]
[]
[]
[]
[]
[]
[]
[]
[]
[]
[]
[]
[]
[]
[]
[]
[]
[]
[]
[]
[]
[]
[]
[]
[]
[]
[]
[]
[]
[]
[]
[]
[]
[]
[]
[]
[]
[]
[]
[]
[]
[]
[]
[]
[]
[]
[]
[]
[]
[]
[]
[]
[]
[]
[]
[]
[]
[]
[]
[]
[]
[]
[]
[]
[]
[]
[]
[]
[]
[]
[]
[]
[]
[]
[]
[]
[]
[]
[]
[]
[]
[]
[]
[]
[]
[]
[]
[]
[]
[]
[]
[]
[]
[]
[]
[]
[]
[]
[]
[]
[]
[]
[]
[]
[]
[]
[]
[]
[]
[]
[]
[]
[]
[]
[]
[]
[]
[]
[]
[]
[]
[]
[]
[]
[]
[]
[]
[]
[]
[]
[]
[]
[]
[]
[]
[]
[]
[]
[]
[]
[]
[]
[]
[]
[]
[]
[]
[]
[]
[]
[]
[]
[]
[]
[]
[]
[]
[]
[]
[]
[]
[]
[]
[]
[]
[]
[]
[]
[]
[]
[]
[]
[]
[]
[]
[]
[]
[]
[]
[]
[]
[]
[]
[]
[]
[]
[]
[]
[]
[]
[]
[]
[]
[]
[]
[]
[]
[]
[]
[]
[]
[]
[]
[]
[]
[]
[]
[]
[]
[]
[]
[]
[]
[]
[]
[]
[]
[]
[]
[]
[]
[]
[]
[]
[]
[]
[]
[]
[]
[]
[]
[]
[]
[]
[]
[]
[]
[]
[]
[]
[]
[]
[]
[]
[]
[]
[]
[]
[]
[]
[]
[]
[]
[]
[]
[]
[]
[]
[]
[]
[]
[]
[]
[]
[]
[]
[]
[]
[]
[]
[]
[]
[]
[]
[]
[]
[]
[]
[]
[]
[]
[]
[]
[]
[]
[]
[]
[]
[]
[]
[]
[]
[]
[]
[]
[]
[]
[]
[]
[]
[]
[]
[]
[]
[]
[]
[]
[]
[]
[]
[]
[]
[]
[]
[]
[]
[]
[]
[]
[]
[]
[]
[]
[]
[]
[]
[]
[]
[]
[]
[]
[]
[]
[]
[]
[]
[]
[]
[]
[]
[]
[]
[]
[]
[]
[]
[]
[]
[]
[]
[]
[]
[]
[]
[]
[]
[]
[]
[]
[]
[]
[]
[]
[]
[]
[]
[]
[]
[]
[]
[]
[]
[]
[]
[]
[]
[]
[]
[]
[]
[]
[]
[]
[]
[]
[]
[]
[]
[]
[]
[]
[]
[]
[]
[]
[]
[]
[]
[]
[]
[]
[]
[]
[]
[]
[]
[]
[]
[]
[]
[]
[]
[]
[]
[]
[]
[]
[]
[]
[]
[]
[]
[]
[]
[]
[]
[]
[]
[]
[]
[]
[]
[]
[]
[]
[]
[]
[]
[]
[]
[]
[]
[]
[]
[]
[]
[]
[]
[]
[]
[]
[]
[]
[]
[]
[]
[]
[]
[]
[]
[]
[]
[]
[]
[]
[]
[]
[]
[]
[]
[]
[]
[]
[]
[]
[]
[]
[]
[]
[]
[]
[]
[]
[]
[]
[]
[]
[]
[]
[]
[]
[]
[]
[]
[]
[]
[]
[]
[]
[]
[]
[]
[]
[]
[]
[]
[]
[]
[]
[]
[]
[]
[]
[]
[]
[]
[]
[]
[]
[]
[]
[]
[]
[]
[]
[]
[]
[]
[]
[]
[]
[]
[]
[]
[]
[]
[]
[]
[]
[]
[]
[]
[]
[]
[]
[]
[]
[]
[]
[]
[]
[]
[]
[]
[]
[]
[]
[]
[]
[]
[]
[]
[]
[]
[]
[]
[]
[]
[]
[]
[]
[]
[]
[]
[]
[]
[]
[]
[]
[]
[]
[]
[]
[]
[]
[]
[]
[]
[]
[]
[]
[]
[]
[]
[]
[]
[]
[]
[]
[]
[]
[]
[]
[]
[]
[]
[]
[]
[]
[]
[]
[]
[]
[]
[]
[]
[]
[]
[]
[]
[]
[]
[]
[]
[]
[]
[]
[]
[]
[]
[]
[]
[]
[]
[]
[]
[]
[]
[]
[]
[]
[]
[]
[]
[]
[]
[]
[]
[]
[]
[]
[]
[]
[]
[]
[]
[]
[]
[]
[]
[]
[]
[]
[]
[]
[]
[]
[]
[]
[]
[]
[]
[]
[]
[]
[]
[]
[]
[]
[]
[]
[]
[]
[]
[]
[]
[]
[]
[]
[]
[]
[]
[]
[]
[]
[]
[]
[]
[]
[]
[]
[]
[]
[]
[]
[]
[]
[]
[]
[]
[]
[]
[]
[]
[]
[]
[]
[]
[]
[]
[]
[]
[]
[]
[]
[]
[]
[]
[]
[]
[]
[]
[]
[]
[]
[]
[]
[]
[]
[]
[]
[]
[]
[]
[]
[]
[]
[]
[]
[]
[]
[]
[]
[]
[]
[]
[]
[]
[]
[]
[]
[]
[]
[]
[]
[]
[]
[]
[]
[]
[]
[]
[]
[]
[]
[]
[]
[]
[]
[]
[]
[]
[]
[]
[]
[]
[]
[]
[]
[]
[]
[]
[]
[]
[]
[]
[]
[]
[]
[]
[]
[]
[]
[]
[]
[]
[]
[]
[]
[]
[]
[]
[]
[]
[]
[]
[]
[]
[]
[]
[]
[]
[]
[]
[]
[]
[]
[]
[]
[]
[]
[]
[]
[]
[]
[]
[]
[]
[]
[]
[]
[]
[]
[]
[]
[]
[]
[]
[]
[]
[]
[]
[]
[]
[]
[]
[]
[]
[]
[]
[]
[]
[]
[]
[]
[]
[]
[]
[]
[]
[]
[]
[]
[]
[]
[]
[]
[]
[]
[]
[]
[]
[]
[]
[]
[]
[]
[]
[]
[]
[]
[]
[]
[]
[]
[]
[]
[]
[]
[]
[]
[]
[]
[]
[]
[]
[]
[]
[]
[]
[]
[]
[]
[]
[]
[]
[]
[]
[]
[]
[]
[]
[]
[]
[]
[]
[]
[]
[]
[]
[]
[]
[]
[]
[]
[]
[]
[]
[]
[]
[]
[]
[]
[]
[]
[]
[]
[]
[]
[]
[]
[]
[]
[]
[]
[]
[]
[]
[]
[]
[]
[]
[]
[]
[]
[]
[]
[]
[]
[]
[]
[]
[]
[]
[]
[]
[]
[]
[]
[]
[]
[]
[]
[]
[]
[]
[]
[]
[]
[]
[]
[]
[]
[]
[]
[]
[]
[]
[]
[]
[]
[]
[]
[]
[]
[]
[]
[]
[]
[]
[]
[]
[]
[]
[]
[]
[]
[]
[]
[]
[]
[]
[]
[]
[]
[]
[]
[]
[]
[]
[]
[]
[]
[]
[]
[]
[]
[]
[]
[]
[]
[]
[]
[]
[]
[]
[]
[]
[]
[]
[]
[]
[]
[]
[]
[]
[]
[]
[]
[]
[]
[]
[]
[]
[]
[]
[]
[]
[]
[]
[]
[]
[]
[]
[]
[]
[]
[]
[]
[]
[]
[]
[]
[]
[]
[]
[]
[]
[]
[]
[]
[]
[]
[]
[]
[]
[]
[]
[]
[]
[]
[]
[]
[]
[]
[]
[]
[]
[]
[]
[]
[]
[]
[]
[]
[]
[]
[]
[]
[]
[]
[]
[]
[]
[]
[]
[]
[]
[]
[]
[]
[]
[]
[]
[]
[]
[]
[]
[]
[]
[]
[]
[]
[]
[]
[]
[]
[]
[]
[]
[]
[]
[]
[]
[]
[]
[]
[]
[]
[]
[]
[]
[]
[]
[]
[]
[]
[]
[]
[]
[]
[]
[]
[]
[]
[]
[]
[]
[]
[]
[]
[]
[]
[]
[]
[]
[]
[]
[]
[]
[]
[]
[]
[]
[]
[]
[]
[]
[]
[]
[]
[]
[]
[]
[]
[]
[]
[]
[]
[]
[]
[]
[]
[]
[]
[]
[]
[]
[]
[]
[]
[]
[]
[]
[]
[]
[]
[]
[]
[]
[]
[]
[]
[]
[]
[]
[]
[]
[]
[]
[]
[]
[]
[]
[]
[]
[]
[]
[]
[]
[]
[]
[]
[]
[]
[]
[]
[]
[]
[]
[]
[]
[]
[]
[]
[]
[]
[]
[]
[]
[]
[]
[]
[]
[]
[]
[]
[]
[]
[]
[]
[]
[]
[]
[]
[]
[]
[]
[]
[]
[]
[]
[]
[]
[]
[]
[]
[]
[]
[]
[]
[]
[]
[]
[]
[]
[]
[]
[]
[]
[]
[]
[]
[]
[]
[]
[]
[]
[]
[]
[]
[]
[]
[]
[]
[]
[]
[]
[]
[]
[]
[]
[]
[]
[]
[]
[]
[]
[]
[]
[]
[]
[]
[]
[]
[]
[]
[]
[]
[]
[]
[]
[]
[]
[]
[]
[]
[]
[]
[]
[]
[]
[]
[]
[]
[]
[]
[]
[]
[]
[]
[]
[]
[]
[]
[]
[]
[]
[]
[]
[]
[]
[]
[]
[]
[]
[]
[]
[]
[]
[]
[]
[]
[]
[]
[]
[]
[]
[]
[]
[]
[]
[]
[]
[]
[]
[]
[]
[]
[]
[]
[]
[]
[]
[]
[]
[]
[]
[]
[]
[]
[]
[]
[]
[]
[]
[]
[]
[]
[]
[]
[]
[]
[]
[]
[]
[]
[]
[]
[]
[]
[]
[]
[]
[]
[]
[]
[]
[]
[]
[]
[]
[]
[]
[]
[]
[]
[]
[]
[]
[]
[]
[]
[]
[]
[]
[]
[]
[]
[]
[]
[]
[]
[]
[]
[]
[]
[]
[]
[]
[]
[]
[]
[]
[]
[]
[]
[]
[]
[]
[]
[]
[]
[]
[]
[]
[]
[]
[]
[]
[]
[]
[]
[]
[]
[]
[]
[]
[]
[]
[]
[]
[]
[]
[]
[]
[]
[]
[]
[]
[]
[]
[]
[]
[]
[]
[]
[]
[]
[]
[]
[]
[]
[]
[]
[]
[]
[]
[]
[]
[]
[]
[]
[]
[]
[]
[]
[]
[]
[]
[]
[]
[]
[]
[]
[]
[]
[]
[]
[]
[]
[]
[]
[]
[]
[]
[]
[]
[]
[]
[]
[]
[]
[]
[]
[]
[]
[]
[]
[]
[]
[]
[]
[]
[]
[]
[]
[]
[]
[]
[]
[]
[]
[]
[]
[]
[]
[]
[]
[]
[]
[]
[]
[]
[]
[]
[]
[]
[]
[]
[]
[]
[]
[]
[]
[]
[]
[]
[]
[]
[]
[]
[]
[]
[]
[]
[]
[]
[]
[]
[]
[]
[]
[]
[]
[]
[]
[]
[]
[]
[]
[]
[]
[]
[]
[]
[]
[]
[]
[]
[]
[]
[]
[]
[]
[]
[]
[]
[]
[]
[]
[]
[]
[]
[]
[]
[]
[]
[]
[]
[]
[]
[]
[]
[]
[]
[]
[]
[]
[]
[]
[]
[]
[]
[]
[]
[]
[]
[]
[]
[]
[]
[]
[]
[]
[]
[]
[]
[]
[]
[]
[]
[]
[]
[]
[]
[]
[]
[]
[]
[]
[]
[]
[]
[]
[]
[]
[]
[]
[]
[]
[]
[]
[]
[]
[]
[]
[]
[]
[]
[]
[]
[]
[]
[]
[]
[]
[]
[]
[]
[]
[]
[]
[]
[]
[]
[]
[]
[]
[]
[]
[]
[]
[]
[]
[]
[]
[]
[]
[]
[]
[]
[]
[]
[]
[]
[]
[]
[]
[]
[]
[]
[]
[]
[]
[]
[]
[]
[]
[]
[]
[]
[]
[]
[]
[]
[]
[]
[]
[]
[]
[]
[]
[]
[]
[]
[]
[]
[]
[]
[]
[]
[]
[]
[]
[]
[]
[]
[]
[]
[]
[]
[]
[]
[]
[]
[]
[]
[]
[]
[]
[]
[]
[]
[]
[]
[]
[]
[]
[]
[]
[]
[]
[]
[]
[]
[]
[]
[]
[]
[]
[]
[]
[]
[]
[]
[]
[]
[]
[]
[]
[]
[]
[]
[]
[]
[]
[]
[]
[]
[]
[]
[]
[]
[]
[]
[]
[]
[]
[]
[]
[]
[]
[]
[]
[]
[]
[]
[]
[]
[]
[]
[]
[]
[]
[]
[]
[]
[]
[]
[]
[]
[]
[]
[]
[]
[]
[]
[]
[]
[]
[]
[]
[]
[]
[]
[]
[]
[]
[]
[]
[]
[]
[]
[]
[]
[]
[]
[]
[]
[]
[]
[]
[]
[]
[]
[]
[]
[]
[]
[]
[]
[]
[]
[]
[]
[]
[]
[]
[]
[]
[]
[]
[]
[]
[]
[]
[]
[]
[]
[]
[]
[]
[]
[]
[]
[]
[]
[]
[]
[]
[]
[]
[]
[]
[]
[]
[]
[]
[]
[]
[]
[]
[]
[]
[]
[]
[]
[]
[]
[]
[]
[]
[]
[]
[]
[]
[]
[]
[]
[]
[]
[]
[]
[]
[]
[]
[]
[]
[]
[]
[]
[]
[]
[]
[]
[]
[]
[]
[]
[]
[]
[]
[]
[]
[]
[]
[]
[]
[]
[]
[]
[]
[]
[]
[]
[]
[]
[]
[]
[]
[]
[]
[]
[]
[]
[]
[]
[]
[]
[]
[]
[]
[]
[]
[]
[]
[]
[]
[]
[]
[]
[]
[]
[]
[]
[]
[]
[]
[]
[]
[]
[]
[]
[]
[]
[]
[]
[]
[]
[]
[]
[]
[]
[]
[]
[]
[]
[]
[]
[]
[]
[]
[]
[]
[]
[]
[]
[]
[]
[]
[]
[]
[]
[]
[]
[]
[]
[]
[]
[]
[]
[]
[]
[]
[]
[]
[]
[]
[]
[]
[]
[]
[]
[]
[]
[]
[]
[]
[]
[]
[]
[]
[]
[]
[]
[]
[]
[]
[]
[]
[]
[]
[]
[]
[]
[]
[]
[]
[]
[]
[]
[]
[]
[]
[]
[]
[]
[]
[]
[]
[]
[]
[]
[]
[]
[]
[]
[]
[]
[]
[]
[]
[]
[]
[]
[]
[]
[]
[]
[]
[]
[]
[]
[]
[]
[]
[]
[]
[]
[]
[]
[]
[]
[]
[]
[]
[]
[]
[]
[]
[]
[]
[]
[]
[]
[]
[]
[]
[]
[]
[]
[]
[]
[]
[]
[]
[]
[]
[]
[]
[]
[]
[]
[]
[]
[]
[]
[]
[]
[]
[]
[]
[]
[]
[]
[]
[]
[]
[]
[]
[]
[]
[]
[]
[]
[]
[]
[]
[]
[]
[]
[]
[]
[]
[]
[]
[]
[]
[]
[]
[]
[]
[]
[]
[]
[]
[]
[]
[]
[]
[]
[]
[]
[]
[]
[]
[]
[]
[]
[]
[]
[]
[]
[]
[]
[]
[]
[]
[]
[]
[]
[]
[]
[]
[]
[]
[]
[]
[]
[]
[]
[]
[]
[]
[]
[]
[]
[]
[]
[]
[]
[]
[]
[]
[]
[]
[]
[]
[]
[]
[]
[]
[]
[]
[]
[]
[]
[]
[]
[]
[]
[]
[]
[]
[]
[]
[]
[]
[]
[]
[]
[]
[]
[]
[]
[]
[]
[]
[]
[]
[]
[]
[]
[]
[]
[]
[]
[]
[]
[]
[]
[]
[]
[]
[]
[]
[]
[]
[]
[]
[]
[]
[]
[]
[]
[]
[]
[]
[]
[]
[]
[]
[]
[]
[]
[]
[]
[]
[]
[]
[]
[]
[]
[]
[]
[]
[]
[]
[]
[]
[]
[]
[]
[]
[]
[]
[]
[]
[]
[]
[]
[]
[]
[]
[]
[]
[]
[]
[]
[]
[]
[]
[]
[]
[]
[]
[]
[]
[]
[]
[]
[]
[]
[]
[]
[]
[]
[]
[]
[]
[]
[]
[]
[]
[]
[]
[]
[]
[]
[]
[]
[]
[]
[]
[]
[]
[]
[]
[]
[]
[]
[]
[]
[]
[]
[]
[]
[]
[]
[]
[]
[]
[]
[]
[]
[]
[]
[]
[]
[]
[]
[]
[]
[]
[]
[]
[]
[]
[]
[]
[]
[]
[]
[]
[]
[]
[]
[]
[]
[]
[]
[]
[]
[]
[]
[]
[]
[]
[]
[]
[]
[]
[]
[]
[]
[]
[]
[]
[]
[]
[]
[]
[]
[]
[]
[]
[]
[]
[]
[]
[]
[]
[]
[]
[]
[]
[]
[]
[]
[]
[]
[]
[]
[]
[]
[]
[]
[]
[]
[]
[]
[]
[]
[]
[]
[]
[]
[]
[]
[]
[]
[]
[]
[]
[]
[]
[]
[]
[]
[]
[]
[]
[]
[]
[]
[]
[]
[]
[]
[]
[]
[]
[]
[]
[]
[]
[]
[]
[]
[]
[]
[]
[]
[]
[]
[]
[]
[]
[]
[]
[]
[]
[]
[]
[]
[]
[]
[]
[]
[]
[]
[]
[]
[]
[]
[]
[]
[]
[]
[]
[]
[]
[]
[]
[]
[]
[]
[]
[]
[]
[]
[]
[]
[]
[]
[]
[]
[]
[]
[]
[]
[]
[]
[]
[]
[]
[]
[]
[]
[]
[]
[]
[]
[]
[]
[]
[]
[]
[]
[]
[]
[]
[]
[]
[]
[]
[]
[]
[]
[]
[]
[]
[]
[]
[]
[]
[]
[]
[]
[]
[]
[]
[]
[]
[]
[]
[]
[]
[]
[]
[]
[]
[]
[]
[]
[]
[]
[]
[]
[]
[]
[]
[]
[]
[]
[]
[]
[]
[]
[]
[]
[]
[]
[]
[]
[]
[]
[]
[]
[]
[]
[]
[]
[]
[]
[]
[]
[]
[]
[]
[]
[]
[]
[]
[]
[]
[]
[]
[]
[]
[]
[]
[]
[]
[]
[]
[]
[]
[]
[]
[]
[]
[]
[]
[]
[]
[]
[]
[]
[]
[]
[]
[]
[]
[]
[]
[]
[]
[]
[]
[]
[]
[]
[]
[]
[]
[]
[]
[]
[]
[]
[]
[]
[]
[]
[]
[]
[]
[]
[]
[]
[]
[]
[]
[]
[]
[]
[]
[]
[]
[]
[]
[]
[]
[]
[]
[]
[]
[]
[]
[]
[]
[]
[]
[]
[]
[]
[]
[]
[]
[]
[]
[]
[]
[]
[]
[]
[]
[]
[]
[]
[]
[]
[]
[]
[]
[]
[]
[]
[]
[]
[]
[]
[]
[]
[]
[]
[]
[]
[]
[]
[]
[]
[]
[]
[]
[]
[]
[]
[]
[]
[]
[]
[]
[]
[]
[]
[]
[]
[]
[]
[]
[]
[]
[]
[]
[]
[]
[]
[]
[]
[]
[]
[]
[]
[]
[]
[]
[]
[]
[]
[]
[]
[]
[]
[]
[]
[]
[]
[]
[]
[]
[]
[]
[]
[]
[]
[]
[]
[]
[]
[]
[]
[]
[]
[]
[]
[]
[]
[]
[]
[]
[]
[]
[]
[]
[]
[]
[]
[]
[]
[]
[]
[]
[]
[]
[]
[]
[]
[]
[]
[]
[]
[]
[]
[]
[]
[]
[]
[]
[]
[]
[]
[]
[]
[]
[]
[]
[]
[]
[]
[]
[]
[]
[]
[]
[]
[]
[]
[]
[]
[]
[]
[]
[]
[]
[]
[]
[]
[]
[]
[]
[]
[]
[]
[]
[]
[]
[]
[]
[]
[]
[]
[]
[]
[]
[]
[]
[]
[]
[]
[]
[]
[]
[]
[]
[]
[]
[]
[]
[]
[]
[]
[]
[]
[]
[]
[]
[]
[]
[]
[]
[]
[]
[]
[]
[]
[]
[]
[]
[]
[]
[]
[]
[]
[]
[]
[]
[]
[]
[]
[]
[]
[]
[]
[]
[]
[]
[]
[]
[]
[]
[]
[]
[]
[]
[]
[]
[]
[]
[]
[]
[]
[]
[]
[]
[]
[]
[]
[]
[]
[]
[]
[]
[]
[]
[]
[]
[]
[]
[]
[]
[]
[]
[]
[]
[]
[]
[]
[]
[]
[]
[]
[]
[]
[]
[]
[]
[]
[]
[]
[]
[]
[]
[]
[]
[]
[]
[]
[]
[]
[]
[]
[]
[]
[]
[]
[]
[]
[]
[]
[]
[]
[]
[]
[]
[]
[]
[]
[]
[]
[]
[]
[]
[]
[]
[]
[]
[]
[]
[]
[]
[]
[]
[]
[]
[]
[]
[]
[]
[]
[]
[]
[]
[]
[]
[]
[]
[]
[]
[]
[]
[]
[]
[]
[]
[]
[]
[]
[]
[]
[]
[]
[]
[]
[]
[]
[]
[]
[]
[]
[]
[]
[]
[]
[]
[]
[]
[]
[]
[]
[]
[]
[]
[]
[]
[]
[]
[]
[]
[]
[]
[]
[]
[]
[]
[]
[]
[]
[]
[]
[]
[]
[]
[]
[]
[]
[]
[]
[]
[]
[]
[]
[]
[]
[]
[]
[]
[]
[]
[]
[]
[]
[]
[]
[]
[]
[]
[]
[]
[]
[]
[]
[]
[]
[]
[]
[]
[]
[]
[]
[]
[]
[]
[]
[]
[]
[]
[]
[]
[]
[]
[]
[]
[]
[]
[]
[]
[]
[]
[]
[]
[]
[]
[]
[]
[]
[]
[]
[]
[]
[]
[]
[]
[]
[]
[]
[]
[]
[]
[]
[]
[]
[]
[]
[]
[]
[]
[]
[]
[]
[]
[]
[]
[]
[]
[]
[]
[]
[]
[]
[]
[]
[]
[]
[]
[]
[]
[]
[]
[]
[]
[]
[]
[]
[]
[]
[]
[]
[]
[]
[]
[]
[]
[]
[]
[]
[]
[]
[]
[]
[]
[]
[]
[]
[]
[]
[]
[]
[]
[]
[]
[]
[]
[]
[]
[]
[]
[]
[]
[]
[]
[]
[]
[]
[]
[]
[]
[]
[]
[]
[]
[]
[]
[]
[]
[]
[]
[]
[]
[]
[]
[]
[]
[]
[]
[]
[]
[]
[]
[]
[]
[]
[]
[]
[]
[]
[]
[]
[]
[]
[]
[]
[]
[]
[]
[]
[]
[]
[]
[]
[]
[]
[]
[]
[]
[]
[]
[]
[]
[]
[]
[]
[]
[]
[]
[]
[]
[]
[]
[]
[]
[]
[]
[]
[]
[]
[]
[]
[]
[]
[]
[]
[]
[]
[]
[]
[]
[]
[]
[]
[]
[]
[]
[]
[]
[]
[]
[]
[]
[]
[]
[]
[]
[]
[]
[]
[]
[]
[]
[]
[]
[]
[]
[]
[]
[]
[]
[]
[]
[]
[]
[]
[]
[]
[]
[]
[]
[]
[]
[]
[]
[]
[]
[]
[]
[]
[]
[]
[]
[]
[]
[]
[]
[]
[]
[]
[]
[]
[]
[]
[]
[]
[]
[]
[]
[]
[]
[]
[]
[]
[]
[]
[]
[]
[]
[]
[]
[]
[]
[]
[]
[]
[]
[]
[]
[]
[]
[]
[]
[]
[]
[]
[]
[]
[]
[]
[]
[]
[]
[]
[]
[]
[]
[]
[]
[]
[]
[]
[]
[]
[]
[]
[]
[]
[]
[]
[]
[]
[]
[]
[]
[]
[]
[]
[]
[]
[]
[]
[]
[]
[]
[]
[]
[]
[]
[]
[]
[]
[]
[]
[]
[]
[]
[]
[]
[]
[]
[]
[]
[]
[]
[]
[]
[]
[]
[]
[]
[]
[]
[]
[]
[]
[]
[]
[]
[]
[]
[]
[]
[]
[]
[]
[]
[]
[]
[]
[]
[]
[]
[]
[]
[]
[]
[]
[]
[]
[]
[]
[]
[]
[]
[]
[]
[]
[]
[]
[]
[]
[]
[]
[]
[]
[]
[]
[]
[]
[]
[]
[]
[]
[]
[]
[]
[]
[]
[]
[]
[]
[]
[]
[]
[]
[]
[]
[]
[]
[]
[]
[]
[]
[]
[]
[]
[]
[]
[]
[]
[]
[]
[]
[]
[]
[]
[]
[]
[]
[]
[]
[]
[]
[]
[]
[]
[]
[]
[]
[]
[]
[]
[]
[]
[]
[]
[]
[]
[]
[]
[]
[]
[]
[]
[]
[]
[]
[]
[]
[]
[]
[]
[]
[]
[]
[]
[]
[]
[]
[]
[]
[]
[]
[]
[]
[]
[]
[]
[]
[]
[]
[]
[]
[]
[]
[]
[]
[]
[]
[]
[]
[]
[]
[]
[]
[]
[]
[]
[]
[]
[]
[]
[]
[]
[]
[]
[]
[]
[]
[]
[]
[]
[]
[]
[]
[]
[]
[]
[]
[]
[]
[]
[]
[]
[]
[]
[]
[]
[]
[]
[]
[]
[]
[]
[]
[]
[]
[]
[]
[]
[]
[]
[]
[]
[]
[]
[]
[]
[]
[]
[]
[]
[]
[]
[]
[]
[]
[]
[]
[]
[]
[]
[]
[]
[]
[]
[]
[]
[]
[]
[]
[]
[]
[]
[]
[]
[]
[]
[]
[]
[]
[]
[]
[]
[]
[]
[]
[]
[]
[]
[]
[]
[]
[]
[]
[]
[]
[]
[]
[]
[]
[]
[]
[]
[]
[]
[]
[]
[]
[]
[]
[]
[]
[]
[]
[]
[]
[]
[]
[]
[]
[]
[]
[]
[]
[]
[]
[]
[]
[]
[]
[]
[]
[]
[]
[]
[]
[]
[]
[]
[]
[]
[]
[]
[]
[]
[]
[]
[]
[]
[]
[]
[]
[]
[]
[]
[]
[]
[]
[]
[]
[]
[]
[]
[]
[]
[]
[]
[]
[]
[]
[]
[]
[]
[]
[]
[]
[]
[]
[]
[]
[]
[]
[]
[]
[]
[]
[]
[]
[]
[]
[]
[]
[]
[]
[]
[]
[]
[]
[]
[]
[]
[]
[]
[]
[]
[]
[]
[]
[]
[]
[]
[]
[]
[]
[]
[]
[]
[]
[]
[]
[]
[]
[]
[]
[]
[]
[]
[]
[]
[]
[]
[]
[]
[]
[]
[]
[]
[]
[]
[]
[]
[]
[]
[]
[]
[]
[]
[]
[]
[]
[]
[]
[]
[]
[]
[]
[]
[]
[]
[]
[]
[]
[]
[]
[]
[]
[]
[]
[]
[]
[]
[]
[]
[]
[]
[]
[]
[]
[]
[]
[]
[]
[]
[]
[]
[]
[]
[]
[]
[]
[]
[]
[]
[]
[]
[]
[]
[]
[]
[]
[]
[]
[]
[]
[]
[]
[]
[]
[]
[]
[]
[]
[]
[]
[]
[]
[]
[]
[]
[]
[]
[]
[]
[]
[]
[]
[]
[]
[]
[]
[]
[]
[]
[]
[]
[]
[]
[]
[]
[]
[]
[]
[]
[]
[]
[]
[]
[]
[]
[]
[]
[]
[]
[]
[]
[]
[]
[]
[]
[]
[]
[]
[]
[]
[]
[]
[]
[]
[]
[]
[]
[]
[]
[]
[]
[]
[]
[]
[]
[]
[]
[]
[]
[]
[]
[]
[]
[]
[]
[]
[]
[]
[]
[]
[]
[]
[]
[]
[]
[]
[]
[]
[]
[]
[]
[]
[]
[]
[]
[]
[]
[]
[]
[]
[]
[]
[]
[]
[]
[]
[]
[]
[]
[]
[]
[]
[]
[]
[]
[]
[]
[]
[]
[]
[]
[]
[]
[]
[]
[]
[]
[]
[]
[]
[]
[]
[]
[]
[]
[]
[]
[]
[]
[]
[]
[]
[]
[]
[]
[]
[]
[]
[]
[]
[]
[]
[]
[]
[]
[]
[]
[]
[]
[]
[]
[]
[]
[]
[]
[]
[]
[]
[]
[]
[]
[]
[]
[]
[]
[]
[]
[]
[]
[]
[]
[]
[]
[]
[]
[]
[]
[]
[]
[]
[]
[]
[]
[]
[]
[]
[]
[]
[]
[]
[]
[]
[]
[]
[]
[]
[]
[]
[]
[]
[]
[]
[]
[]
[]
[]
[]
[]
[]
[]
[]
[]
[]
[]
[]
[]
[]
[]
[]
[]
[]
[]
[]
[]
[]
[]
[]
[]
[]
[]
[]
[]
[]
[]
[]
[]
[]
[]
[]
[]
[]
[]
[]
[]
[]
[]
[]
[]
[]
[]
[]
[]
[]
[]
[]
[]
[]
[]
[]
[]
[]
[]
[]
[]
[]
[]
[]
[]
[]
[]
[]
[]
[]
[]
[]
[]
[]
[]
[]
[]
[]
[]
[]
[]
[]
[]
[]
[]
[]
[]
[]
[]
[]
[]
[]
[]
[]
[]
[]
[]
[]
[]
[]
[]
[]
[]
[]
[]
[]
[]
[]
[]
[]
[]
[]
[]
[]
[]
[]
[]
[]
[]
[]
[]
[]
[]
[]
[]
[]
[]
[]
[]
[]
[]
[]
[]
[]
[]
[]
[]
[]
[]
[]
[]
[]
[]
[]
[]
[]
[]
[]
[]
[]
[]
[]
[]
[]
[]
[]
[]
[]
[]
[]
[]
[]
[]
[]
[]
[]
[]
[]
[]
[]
[]
[]
[]
[]
[]
[]
[]
[]
[]
[]
[]
[]
[]
[]
[]
[]
[]
[]
[]
[]
[]
[]
[]
[]
[]
[]
[]
[]
[]
[]
[]
[]
[]
[]
[]
[]
[]
[]
[]
[]
[]
[]
[]
[]
[]
[]
[]
[]
[]
[]
[]
[]
[]
[]
[]
[]
[]
[]
[]
[]
[]
[]
[]
[]
[]
[]
[]
[]
[]
[]
[]
[]
[]
[]
[]
[]
[]
[]
[]
[]
[]
[]
[]
[]
[]
[]
[]
[]
[]
[]
[]
[]
[]
[]
[]
[]
[]
[]
[]
[]
[]
[]
[]
[]
[]
[]
[]
[]
[]
[]
[]
[]
[]
[]
[]
[]
[]
[]
[]
[]
[]
[]
[]
[]
[]
[]
[]
[]
[]
[]
[]
[]
[]
[]
[]
[]
[]
[]
[]
[]
[]
[]
[]
[]
[]
[]
[]
[]
[]
[]
[]
[]
[]
[]
[]
[]
[]
[]
[]
[]
[]
[]
[]
[]
[]
[]
[]
[]
[]
[]
[]
[]
[]
[]
[]
[]
[]
[]
[]
[]
[]
[]
[]
[]
[]
[]
[]
[]
[]
[]
[]
[]
[]
[]
[]
[]
[]
[]
[]
[]
[]
[]
[]
[]
[]
[]
[]
[]
[]
[]
[]
[]
[]
[]
[]
[]
[]
[]
[]
[]
[]
[]
[]
[]
[]
[]
[]
[]
[]
[]
[]
[]
[]
[]
[]
[]
[]
[]
[]
[]
[]
[]
[]
[]
[]
[]
[]
[]
[]
[]
[]
[]
[]
[]
[]
[]
[]
[]
[]
[]
[]
[]
[]
[]
[]
[]
[]
[]
[]
[]
[]
[]
[]
[]
[]
[]
[]
[]
[]
[]
[]
[]
[]
[]
[]
[]
[]
[]
[]
[]
[]
[]
[]
[]
[]
[]
[]
[]
[]
[]
[]
[]
[]
[]
[]
[]
[]
[]
[]
[]
[]
[]
[]
[]
[]
[]
[]
[]
[]
[]
[]
[]
[]
[]
[]
[]
[]
[]
[]
[]
[]
[]
[]
[]
[]
[]
[]
[]
[]
[]
[]
[]
[]
[]
[]
[]
[]
[]
[]
[]
[]
[]
[]
[]
[]
[]
[]
[]
[]
[]
[]
[]
[]
[]
[]
[]
[]
[]
[]
[]
[]
[]
[]
[]
[]
[]
[]
[]
[]
[]
[]
[]
[]
[]
[]
[]
[]
[]
[]
[]
[]
[]
[]
[]
[]
[]
[]
[]
[]
[]
[]
[]
[]
[]
[]
[]
[]
[]
[]
[]
[]
[]
[]
[]
[]
[]
[]
[]
[]
[]
[]
[]
[]
[]
[]
[]
[]
[]
[]
[]
[]
[]
[]
[]
[]
[]
[]
[]
[]
[]
[]
[]
[]
[]
[]
[]
[]
[]
[]
[]
[]
[]
[]
[]
[]
[]
[]
[]
[]
[]
[]
[]
[]
[]
[]
[]
[]
[]
[]
[]
[]
[]
[]
[]
[]
[]
[]
[]
[]
[]
[]
[]
[]
[]
[]
[]
[]
[]
[]
[]
[]
[]
[]
[]
[]
[]
[]
[]
[]
[]
[]
[]
[]
[]
[]
[]
[]
[]
[]
[]
[]
[]
[]
[]
[]
[]
[]
[]
[]
[]
[]
[]
[]
[]
[]
[]
[]
[]
[]
[]
[]
[]
[]
[]
[]
[]
[]
[]
[]
[]
[]
[]
[]
[]
[]
[]
[]
[]
[]
[]
[]
[]
[]
[]
[]
[]
[]
[]
[]
[]
[]
[]
[]
[]
[]
[]
[]
[]
[]
[]
[]
[]
[]
[]
[]
[]
[]
[]
[]
[]
[]
[]
[]
[]
[]
[]
[]
[]
[]
[]
[]
[]
[]
[]
[]
[]
[]
[]
[]
[]
[]
[]
[]
[]
[]
[]
[]
[]
[]
[]
[]
[]
[]
[]
[]
[]
[]
[]
[]
[]
[]
[]
[]
[]
[]
[]
[]
[]
[]
[]
[]
[]
[]
[]
[]
[]
[]
[]
[]
[]
[]
[]
[]
[]
[]
[]
[]
[]
[]
[]
[]
[]
[]
[]
[]
[]
[]
[]
[]
[]
[]
[]
[]
[]
[]
[]
[]
[]
[]
[]
[]
[]
[]
[]
[]
[]
[]
[]
[]
[]
[]
[]
[]
[]
[]
[]
[]
[]
[]
[]
[]
[]
[]
[]
[]
[]
[]
[]
[]
[]
[]
[]
[]
[]
[]
[]
[]
[]
[]
[]
[]
[]
[]
[]
[]
[]
[]
[]
[]
[]
[]
[]
[]
[]
[]
[]
[]
[]
[]
[]
[]
[]
[]
[]
[]
[]
[]
[]
[]
[]
[]
[]
[]
[]
[]
[]
[]
[]
[]
[]
[]
[]
[]
[]
[]
[]
[]
[]
[]
[]
[]
[]
[]
[]
[]
[]
[]
[]
[]
[]
[]
[]
[]
[]
[]
[]
[]
[]
[]
[]
[]
[]
[]
[]
[]
[]
[]
[]
[]
[]
[]
[]
[]
[]
[]
[]
[]
[]
[]
[]
[]
[]
[]
[]
[]
[]
[]
[]
[]
[]
[]
[]
[]
[]
[]
[]
[]
[]
[]
[]
[]
[]
[]
[]
[]
[]
[]
[]
[]
[]
[]
[]
[]
[]
[]
[]
[]
[]
[]
[]
[]
[]
[]
[]
[]
[]
[]
[]
[]
[]
[]
[]
[]
[]
[]
[]
[]
[]
[]
[]
[]
[]
[]
[]
[]
[]
[]
[]
[]
[]
[]
[]
[]
[]
[]
[]
[]
[]
[]
[]
[]
[]
[]
[]
[]
[]
[]
[]
[]
[]
[]
[]
[]
[]
[]
[]
[]
[]
[]
[]
[]
[]
[]
[]
[]
[]
[]
[]
[]
[]
[]
[]
[]
[]
[]
[]
[]
[]
[]
[]
[]
[]
[]
[]
[]
[]
[]
[]
[]
[]
[]
[]
[]
[]
[]
[]
[]
[]
[]
[]
[]
[]
[]
[]
[]
[]
[]
[]
[]
[]
[]
[]
[]
[]
[]
[]
[]
[]
[]
[]
[]
[]
[]
[]
[]
[]
[]
[]
[]
[]
[]
[]
[]
[]
[]
[]
[]
[]
[]
[]
[]
[]
[]
[]
[]
[]
[]
[]
[]
[]
[]
[]
[]
[]
[]
[]
[]
[]
[]
[]
[]
[]
[]
[]
[]
[]
[]
[]
[]
[]
[]
[]
[]
[]
[]
[]
[]
[]
[]
[]
[]
[]
[]
[]
[]
[]
[]
[]
[]
[]
[]
[]
[]
[]
[]
[]
[]
[]
[]
[]
[]
[]
[]
[]
[]
[]
[]
[]
[]
[]
[]
[]
[]
[]
[]
[]
[]
[]
[]
[]
[]
[]
[]
[]
[]
[]
[]
[]
[]
[]
[]
[]
[]
[]
[]
[]
[]
[]
[]
[]
[]
[]
[]
[]
[]
[]
[]
[]
[]
[]
[]
[]
[]
[]
[]
[]
[]
[]
[]
[]
[]
[]
[]
[]
[]
[]
[]
[]
[]
[]
[]
[]
[]
[]
[]
[]
[]
[]
[]
[]
[]
[]
[]
[]
[]
[]
[]
[]
[]
[]
[]
[]
[]
[]
[]
[]
[]
[]
[]
[]
[]
[]
[]
[]
[]
[]
[]
[]
[]
[]
[]
[]
[]
[]
[]
[]
[]
[]
[]
[]
[]
[]
[]
[]
[]
[]
[]
[]
[]
[]
[]
[]
[]
[]
[]
[]
[]
[]
[]
[]
[]
[]
[]
[]
[]
[]
[]
[]
[]
[]
[]
[]
[]
[]
[]
[]
[]
[]
[]
[]
[]
[]
[]
[]
[]
[]
[]
[]
[]
[]
[]
[]
[]
[]
[]
[]
[]
[]
[]
[]
[]
[]
[]
[]
[]
[]
[]
[]
[]
[]
[]
[]
[]
[]
[]
[]
[]
[]
[]
[]
[]
[]
[]
[]
[]
[]
[]
[]
[]
[]
[]
[]
[]
[]
[]
[]
[]
[]
[]
[]
[]
[]
[]
[]
[]
[]
[]
[]
[]
[]
[]
[]
[]
[]
[]
[]
[]
[]
[]
[]
[]
[]
[]
[]
[]
[]
[]
[]
[]
[]
[]
[]
[]
[]
[]
[]
[]
[]
[]
[]
[]
[]
[]
[]
[]
[]
[]
[]
[]
[]
[]
[]
[]
[]
[]
[]
[]
[]
[]
[]
[]
[]
[]
[]
[]
[]
[]
[]
[]
[]
[]
[]
[]
[]
[]
[]
[]
[]
[]
[]
[]
[]
[]
[]
[]
[]
[]
[]
[]
[]
[]
[]
[]
[]
[]
[]
[]
[]
[]
[]
[]
[]
[]
[]
[]
[]
[]
[]
[]
[]
[]
[]
[]
[]
[]
[]
[]
[]
[]
[]
[]
[]
[]
[]
[]
[]
[]
[]
[]
[]
[]
[]
[]
[]
[]
[]
[]
[]
[]
[]
[]
[]
[]
[]
[]
[]
[]
[]
[]
[]
[]
[]
[]
[]
[]
[]
[]
[]
[]
[]
[]
[]
[]
[]
[]
[]
[]
[]
[]
[]
[]
[]
[]
[]
[]
[]
[]
[]
[]
[]
[]
[]
[]
[]
[]
[]
[]
[]
[]
[]
[]
[]
[]
[]
[]
[]
[]
[]
[]
[]
[]
[]
[]
[]
[]
[]
[]
[]
[]
[]
[]
[]
[]
[]
[]
[]
[]
[]
[]
[]
[]
[]
[]
[]
[]
[]
[]
[]
[]
[]
[]
[]
[]
[]
[]
[]
[]
[]
[]
[]
[]
[]
[]
[]
[]
[]
[]
[]
[]
[]
[]
[]
[]
[]
[]
[]
[]
[]
[]
[]
[]
[]
[]
[]
[]
[]
[]
[]
[]
[]
[]
[]
[]
[]
[]
[]
[]
[]
[]
[]
[]
[]
[]
[]
[]
[]
[]
[]
[]
[]
[]
[]
[]
[]
[]
[]
[]
[]
[]
[]
[]
[]
[]
[]
[]
[]
[]
[]
[]
[]
[]
[]
[]
[]
[]
[]
[]
[]
[]
[]
[]
[]
[]
[]
[]
[]
[]
[]
[]
[]
[]
[]
[]
[]
[]
[]
[]
[]
[]
[]
[]
[]
[]
[]
[]
[]
[]
[]
[]
[]
[]
[]
[]
[]
[]
[]
[]
[]
[]
[]
[]
[]
[]
[]
[]
[]
[]
[]
[]
[]
[]
[]
[]
[]
[]
[]
[]
[]
[]
[]
[]
[]
[]
[]
[]
[]
[]
[]
[]
[]
[]
[]
[]
[]
[]
[]
[]
[]
[]
[]
[]
[]
[]
[]
[]
[]
[]
[]
[]
[]
[]
[]
[]
[]
[]
[]
[]
[]
[]
[]
[]
[]
[]
[]
[]
[]
[]
[]
[]
[]
[]
[]
[]
[]
[]
[]
[]
[]
[]
[]
[]
[]
[]
[]
[]
[]
[]
[]
[]
[]
[]
[]
[]
[]
[]
[]
[]
[]
[]
[]
[]
[]
[]
[]
[]
[]
[]
[]
[]
[]
[]
[]
[]
[]
[]
[]
[]
[]
[]
[]
[]
[]
[]
[]
[]
[]
[]
[]
[]
[]
[]
[]
[]
[]
[]
[]
[]
[]
[]
[]
[]
[]
[]
[]
[]
[]
[]
[]
[]
[]
[]
[]
[]
[]
[]
[]
[]
[]
[]
[]
[]
[]
[]
[]
[]
[]
[]
[]
[]
[]
[]
[]
[]
[]
[]
[]
[]
[]
[]
[]
[]
[]
[]
[]
[]
[]
[]
[]
[]
[]
[]
[]
[]
[]
[]
[]
[]
[]
[]
[]
[]
[]
[]
[]
[]
[]
[]
[]
[]
[]
[]
[]
[]
[]
[]
[]
[]
[]
[]
[]
[]
[]
[]
[]
[]
[]
[]
[]
[]
[]
[]
[]
[]
[]
[]
[]
[]
[]
[]
[]
[]
[]
[]
[]
[]
[]
[]
[]
[]
[]
[]
[]
[]
[]
[]
[]
[]
[]
[]
[]
[]
[]
[]
[]
[]
[]
[]
[]
[]
[]
[]
[]
[]
[]
[]
[]
[]
[]
[]
[]
[]
[]
[]
[]
[]
[]
[]
[]
[]
[]
[]
[]
[]
[]
[]
[]
[]
[]
[]
[]
[]
[]
[]
[]
[]
[]
[]
[]
[]
[]
[]
[]
[]
[]
[]
[]
[]
[]
[]
[]
[]
[]
[]
[]
[]
[]
[]
[]
[]
[]
[]
[]
[]
[]
[]
[]
[]
[]
[]
[]
[]
[]
[]
[]
[]
[]
[]
[]
[]
[]
[]
[]
[]
[]
[]
[]
[]
[]
[]
[]
[]
[]
[]
[]
[]
[]
[]
[]
[]
[]
[]
[]
[]
[]
[]
[]
[]
[]
[]
[]
[]
[]
[]
[]
[]
[]
[]
[]
[]
[]
[]
[]
[]
[]
[]
[]
[]
[]
[]
[]
[]
[]
[]
[]
[]
[]
[]
[]
[]
[]
[]
[]
[]
[]
[]
[]
[]
[]
[]
[]
[]
[]
[]
[]
[]
[]
[]
[]
[]
[]
[]
[]
[]
[]
[]
[]
[]
[]
[]
[]
[]
[]
[]
[]
[]
[]
[]
[]
[]
[]
[]
[]
[]
[]
[]
[]
[]
[]
[]
[]
[]
[]
[]
[]
[]
[]
[]
[]
[]
[]
[]
[]
[]
[]
[]
[]
[]
[]
[]
[]
[]
[]
[]
[]
[]
[]
[]
[]
[]
[]
[]
[]
[]
[]
[]
[]
[]
[]
[]
[]
[]
[]
[]
[]
[]
[]
[]
[]
[]
[]
[]
[]
[]
[]
[]
[]
[]
[]
[]
[]
[]
[]
[]
[]
[]
[]
[]
[]
[]
[]
[]
[]
[]
[]
[]
[]
[]
[]
[]
[]
[]
[]
[]
[]
[]
[]
[]
[]
[]
[]
[]
[]
[]
[]
[]
[]
[]
[]
[]
[]
[]
[]
[]
[]
[]
[]
[]
[]
[]
[]
[]
[]
[]
[]
[]
[]
[]
[]
[]
[]
[]
[]
[]
[]
[]
[]
[]
[]
[]
[]
[]
[]
[]
[]
[]
[]
[]
[]
[]
[]
[]
[]
[]
[]
[]
[]
[]
[]
[]
[]
[]
[]
[]
[]
[]
[]
[]
[]
[]
[]
[]
[]
[]
[]
[]
[]
[]
[]
[]
[]
[]
[]
[]
[]
[]
[]
[]
[]
[]
[]
[]
[]
[]
[]
[]
[]
[]
[]
[]
[]
[]
[]
[]
[]
[]
[]
[]
[]
[]
[]
[]
[]
[]
[]
[]
[]
[]
[]
[]
[]
[]
[]
[]
[]
[]
[]
[]
[]
[]
[]
[]
[]
[]
[]
[]
[]
[]
[]
[]
[]
[]
[]
[]
[]
[]
[]
[]
[]
[]
[]
[]
[]
[]
[]
[]
[]
[]
[]
[]
[]
[]
[]
[]
[]
[]
[]
[]
[]
[]
[]
[]
[]
[]
[]
[]
[]
[]
[]
[]
[]
[]
[]
[]
[]
[]
[]
[]
[]
[]
[]
[]
[]
[]
[]
[]
[]
[]
[]
[]
[]
[]
[]
[]
[]
[]
[]
[]
[]
[]
[]
[]
[]
[]
[]
[]
[]
[]
[]
[]
[]
[]
[]
[]
[]
[]
[]
[]
[]
[]
[]
[]
[]
[]
[]
[]
[]
[]
[]
[]
[]
[]
[]
[]
[]
[]
[]
[]
[]
[]
[]
[]
[]
[]
[]
[]
[]
[]
[]
[]
[]
[]
[]
[]
[]
[]
[]
[]
[]
[]
[]
[]
[]
[]
[]
[]
[]
[]
[]
[]
[]
[]
[]
[]
[]
[]
[]
[]
[]
[]
[]
[]
[]
[]
[]
[]
[]
[]
[]
[]
[]
[]
[]
[]
[]
[]
[]
[]
[]
[]
[]
[]
[]
[]
[]
[]
[]
[]
[]
[]
[]
[]
[]
[]
[]
[]
[]
[]
[]
[]
[]
[]
[]
[]
[]
[]
[]
[]
[]
[]
[]
[]
[]
[]
[]
[]
[]
[]
[]
[]
[]
[]
[]
[]
[]
[]
[]
[]
[]
[]
[]
[]
[]
[]
[]
[]
[]
[]
[]
[]
[]
[]
[]
[]
[]
[]
[]
[]
[]
[]
[]
[]
[]
[]
[]
[]
[]
[]
[]
[]
[]
[]
[]
[]
[]
[]
[]
[]
[]
[]
[]
[]
[]
[]
[]
[]
[]
[]
[]
[]
[]
[]
[]
[]
[]
[]
[]
[]
[]
[]
[]
[]
[]
[]
[]
[]
[]
[]
[]
[]
[]
[]
[]
[]
[]
[]
[]
[]
[]
[]
[]
[]
[]
[]
[]
[]
[]
[]
[]
[]
[]
[]
[]
[]
[]
[]
[]
[]
[]
[]
[]
[]
[]
[]
[]
[]
[]
[]
[]
[]
[]
[]
[]
[]
[]
[]
[]
[]
[]
[]
[]
[]
[]
[]
[]
[]
[]
[]
[]
[]
[]
[]
[]
[]
[]
[]
[]
[]
[]
[]
[]
[]
[]
[]
[]
[]
[]
[]
[]
[]
[]
[]
[]
[]
[]
[]
[]
[]
[]
[]
[]
[]
[]
[]
[]
[]
[]
[]
[]
[]
[]
[]
[]
[]
[]
[]
[]
[]
[]
[]
[]
[]
[]
[]
[]
[]
[]
[]
[]
[]
[]
[]
[]
[]
[]
[]
[]
[]
[]
[]
[]
[]
[]
[]
[]
[]
[]
[]
[]
[]
[]
[]
[]
[]
[]
[]
[]
[]
[]
[]
[]
[]
[]
[]
[]
[]
[]
[]
[]
[]
[]
[]
[]
[]
[]
[]
[]
[]
[]
[]
[]
[]
[]
[]
[]
[]
[]
[]
[]
[]
[]
[]
[]
[]
[]
[]
[]
[]
[]
[]
[]
[]
[]
[]
[]
[]
[]
[]
[]
[]
[]
[]
[]
[]
[]
[]
[]
[]
[]
[]
[]
[]
[]
[]
[]
[]
[]
[]
[]
[]
[]
[]
[]
[]
[]
[]
[]
[]
[]
[]
[]
[]
[]
[]
[]
[]
[]
[]
[]
[]
[]
[]
[]
[]
[]
[]
[]
[]
[]
[]
[]
[]
[]
[]
[]
[]
[]
[]
[]
[]
[]
[]
[]
[]
[]
[]
[]
[]
[]
[]
[]
[]
[]
[]
[]
[]
[]
[]
[]
[]
[]
[]
[]
[]
[]
[]
[]
[]
[]
[]
[]
[]
[]
[]
[]
[]
[]
[]
[]
[]
[]
[]
[]
[]
[]
[]
[]
[]
[]
[]
[]
[]
[]
[]
[]
[]
[]
[]
[]
[]
[]
[]
[]
[]
[]
[]
[]
[]
[]
[]
[]
[]
[]
[]
[]
[]
[]
[]
[]
[]
[]
[]
[]
[]
[]
[]
[]
[]
[]
[]
[]
[]
[]
[]
[]
[]
[]
[]
[]
[]
[]
[]
[]
[]
[]
[]
[]
[]
[]
[]
[]
[]
[]
[]
[]
[]
[]
[]
[]
[]
[]
[]
[]
[]
[]
[]
[]
[]
[]
[]
[]
[]
[]
[]
[]
[]
[]
[]
[]
[]
[]
[]
[]
[]
[]
[]
[]
[]
[]
[]
[]
[]
[]
[]
[]
[]
[]
[]
[]
[]
[]
[]
[]
[]
[]
[]
[]
[]
[]
[]
[]
[]
[]
[]
[]
[]
[]
[]
[]
[]
[]
[]
[]
[]
[]
[]
[]
[]
[]
[]
[]
[]
[]
[]
[]
[]
[]
[]
[]
[]
[]
[]
[]
[]
[]
[]
[]
[]
[]
[]
[]
[]
[]
[]
[]
[]
[]
[]
[]
[]
[]
[]
[]
[]
[]
[]
[]
[]
[]
[]
[]
[]
[]
[]
[]
[]
[]
[]
[]
[]
[]
[]
[]
[]
[]
[]
[]
[]
[]
[]
[]
[]
[]
[]
[]
[]
[]
[]
[]
[]
[]
[]
[]
[]
[]
[]
[]
[]
[]
[]
[]
[]
[]
[]
[]
[]
[]
[]
[]
[]
[]
[]
[]
[]
[]
[]
[]
[]
[]
[]
[]
[]
[]
[]
[]
[]
[]
[]
[]
[]
[]
[]
[]
[]
[]
[]
[]
[]
[]
[]
[]
[]
[]
[]
[]
[]
[]
[]
[]
[]
[]
[]
[]
[]
[]
[]
[]
[]
[]
[]
[]
[]
[]
[]
[]
[]
[]
[]
[]
[]
[]
[]
[]
[]
[]
[]
[]
[]
[]
[]
[]
[]
[]
[]
[]
[]
[]
[]
[]
[]
[]
[]
[]
[]
[]
[]
[]
[]
[]
[]
[]
[]
[]
[]
[]
[]
[]
[]
[]
[]
[]
[]
[]
[]
[]
[]
[]
[]
[]
[]
[]
[]
[]
[]
[]
[]
[]
[]
[]
[]
[]
[]
[]
[]
[]
[]
[]
[]
[]
[]
[]
[]
[]
[]
[]
[]
[]
[]
[]
[]
[]
[]
[]
[]
[]
[]
[]
[]
[]
[]
[]
[]
[]
[]
[]
[]
[]
[]
[]
[]
[]
[]
[]
[]
[]
[]
[]
[]
[]
[]
[]
[]
[]
[]
[]
[]
[]
[]
[]
[]
[]
[]
[]
[]
[]
[]
[]
[]
[]
[]
[]
[]
[]
[]
[]
[]
[]
[]
[]
[]
[]
[]
[]
[]
[]
[]
[]
[]
[]
[]
[]
[]
[]
[]
[]
[]
[]
[]
[]
[]
[]
[]
[]
[]
[]
[]
[]
[]
[]
[]
[]
[]
[]
[]
[]
[]
[]
[]
[]
[]
[]
[]
[]
[]
[]
[]
[]
[]
[]
[]
[]
[]
[]
[]
[]
[]
[]
[]
[]
[]
[]
[]
[]
[]
[]
[]
[]
[]
[]
[]
[]
[]
[]
[]
[]
[]
[]
[]
[]
[]
[]
[]
[]
[]
[]
[]
[]
[]
[]
[]
[]
[]
[]
[]
[]
[]
[]
[]
[]
[]
[]
[]
[]
[]
[]
[]
[]
[]
[]
[]
[]
[]
[]
[]
[]
[]
[]
[]
[]
[]
[]
[]
[]
[]
[]
[]
[]
[]
[]
[]
[]
[]
[]
[]
[]
[]
[]
[]
[]
[]
[]
[]
[]
[]
[]
[]
[]
[]
[]
[]
[]
[]
[]
[]
[]
[]
[]
[]
[]
[]
[]
[]
[]
[]
[]
[]
[]
[]
[]
[]
[]
[]
[]
[]
[]
[]
[]
[]
[]
[]
[]
[]
[]
[]
[]
[]
[]
[]
[]
[]
[]
[]
[]
[]
[]
[]
[]
[]
[]
[]
[]
[]
[]
[]
[]
[]
[]
[]
[]
[]
[]
[]
[]
[]
[]
[]
[]
[]
[]
[]
[]
[]
[]
[]
[]
[]
[]
[]
[]
[]
[]
[]
[]
[]
[]
[]
[]
[]
[]
[]
[]
[]
[]
[]
[]
[]
[]
[]
[]
[]
[]
[]
[]
[]
[]
[]
[]
[]
[]
[]
[]
[]
[]
[]
[]
[]
[]
[]
[]
[]
[]
[]
[]
[]
[]
[]
[]
[]
[]
[]
[]
[]
[]
[]
[]
[]
[]
[]
[]
[]
[]
[]
[]
[]
[]
[]
[]
[]
[]
[]
[]
[]
[]
[]
[]
[]
[]
[]
[]
[]
[]
[]
[]
[]
[]
[]
[]
[]
[]
[]
[]
[]
[]
[]
[]
[]
[]
[]
[]
[]
[]
[]
[]
[]
[]
[]
[]
[]
[]
[]
[]
[]
[]
[]
[]
[]
[]
[]
[]
[]
[]
[]
[]
[]
[]
[]
[]
[]
[]
[]
[]
[]
[]
[]
[]
[]
[]
[]
[]
[]
[]
[]
[]
[]
[]
[]
[]
[]
[]
[]
[]
[]
[]
[]
[]
[]
[]
[]
[]
[]
[]
[]
[]
[]
[]
[]
[]
[]
[]
[]
[]
[]
[]
[]
[]
[]
[]
[]
[]
[]
[]
[]
[]
[]
[]
[]
[]
[]
[]
[]
[]
[]
[]
[]
[]
[]
[]
[]
[]
[]
[]
[]
[]
[]
[]
[]
[]
[]
[]
[]
[]
[]
[]
[]
[]
[]
[]
[]
[]
[]
[]
[]
[]
[]
[]
[]
[]
[]
[]
[]
[]
[]
[]
[]
[]
[]
[]
[]
[]
[]
[]
[]
[]
[]
[]
[]
[]
[]
[]
[]
[]
[]
[]
[]
[]
[]
[]
[]
[]
[]
[]
[]
[]
[]
[]
[]
[]
[]
[]
[]
[]
[]
[]
[]
[]
[]
[]
[]
[]
[]
[]
[]
[]
[]
[]
[]
[]
[]
[]
[]
[]
[]
[]
[]
[]
[]
[]
[]
[]
[]
[]
[]
[]
[]
[]
[]
[]
[]
[]
[]
[]
[]
[]
[]
[]
[]
[]
[]
[]
[]
[]
[]
[]
[]
[]
[]
[]
[]
[]
[]
[]
[]
[]
[]
[]
[]
[]
[]
[]
[]
[]
[]
[]
[]
[]
[]
[]
[]
[]
[]
[]
[]
[]
[]
[]
[]
[]
[]
[]
[]
[]
[]
[]
[]
[]
[]
[]
[]
[]
[]
[]
[]
[]
[]
[]
[]
[]
[]
[]
[]
[]
[]
[]
[]
[]
[]
[]
[]
[]
[]
[]
[]
[]
[]
[]
[]
[]
[]
[]
[]
[]
[]
[]
[]
[]
[]
[]
[]
[]
[]
[]
[]
[]
[]
[]
[]
[]
[]
[]
[]
[]
[]
[]
[]
[]
[]
[]
[]
[]
[]
[]
[]
[]
[]
[]
[]
[]
[]
[]
[]
[]
[]
[]
[]
[]
[]
[]
[]
[]
[]
[]
[]
[]
[]
[]
[]
[]
[]
[]
[]
[]
[]
[]
[]
[]
[]
[]
[]
[]
[]
[]
[]
[]
[]
[]
[]
[]
[]
[]
[]
[]
[]
[]
[]
[]
[]
[]
[]
[]
[]
[]
[]
[]
[]
[]
[]
[]
[]
[]
[]
[]
[]
[]
[]
[]
[]
[]
[]
[]
[]
[]
[]
[]
[]
[]
[]
[]
[]
[]
[]
[]
[]
[]
[]
[]
[]
[]
[]
[]
[]
[]
[]
[]
[]
[]
[]
[]
[]
[]
[]
[]
[]
[]
[]
[]
[]
[]
[]
[]
[]
[]
[]
[]
[]
[]
[]
[]
[]
[]
[]
[]
[]
[]
[]
[]
[]
[]
[]
[]
[]
[]
[]
[]
[]
[]
[]
[]
[]
[]
[]
[]
[]
[]
[]
[]
[]
[]
[]
[]
[]
[]
[]
[]
[]
[]
[]
[]
[]
[]
[]
[]
[]
[]
[]
[]
[]
[]
[]
[]
[]
[]
[]
[]
[]
[]
[]
[]
[]
[]
[]
[]
[]
[]
[]
[]
[]
[]
[]
[]
[]
[]
[]
[]
[]
[]
[]
[]
[]
[]
[]
[]
[]
[]
[]
[]
[]
[]
[]
[]
[]
[]
[]
[]
[]
[]
[]
[]
[]
[]
[]
[]
[]
[]
[]
[]
[]
[]
[]
[]
[]
[]
[]
[]
[]
[]
[]
[]
[]
[]
[]
[]
[]
[]
[]
[]
[]
[]
[]
[]
[]
[]
[]
[]
[]
[]
[]
[]
[]
[]
[]
[]
[]
[]
[]
[]
[]
[]
[]
[]
[]
[]
[]
[]
[]
[]
[]
[]
[]
[]
[]
[]
[]
[]
[]
[]
[]
[]
[]
[]
[]
[]
[]
[]
[]
[]
[]
[]
[]
[]
[]
[]
[]
[]
[]
[]
[]
[]
[]
[]
[]
[]
[]
[]
[]
[]
[]
[]
[]
[]
[]
[]
[]
[]
[]
[]
[]
[]
[]
[]
[]
[]
[]
[]
[]
[]
[]
[]
[]
[]
[]
[]
[]
[]
[]
[]
[]
[]
[]
[]
[]
[]
[]
[]
[]
[]
[]
[]
[]
[]
[]
[]
[]
[]
[]
[]
[]
[]
[]
[]
[]
[]
[]
[]
[]
[]
[]
[]
[]
[]
[]
[]
[]
[]
[]
[]
[]
[]
[]
[]
[]
[]
[]
[]
[]
[]
[]
[]
[]
[]
[]
[]
[]
[]
[]
[]
[]
[]
[]
[]
[]
[]
[]
[]
[]
[]
[]
[]
[]
[]
[]
[]
[]
[]
[]
[]
[]
[]
[]
[]
[]
[]
[]
[]
[]
[]
[]
[]
[]
[]
[]
[]
[]
[]
[]
[]
[]
[]
[]
[]
[]
[]
[]
[]
[]
[]
[]
[]
[]
[]
[]
[]
[]
[]
[]
[]
[]
[]
[]
[]
[]
[]
[]
[]
[]
[]
[]
[]
[]
[]
[]
[]
[]
[]
[]
[]
[]
[]
[]
[]
[]
[]
[]
[]
[]
[]
[]
[]
[]
[]
[]
[]
[]
[]
[]
[]
[]
[]
[]
[]
[]
[]
[]
[]
[]
[]
[]
[]
[]
[]
[]
[]
[]
[]
[]
[]
[]
[]
[]
[]
[]
[]
[]
[]
[]
[]
[]
[]
[]
[]
[]
[]
[]
[]
[]
[]
[]
[]
[]
[]
[]
[]
[]
[]
[]
[]
[]
[]
[]
[]
[]
[]
[]
[]
[]
[]
[]
[]
[]
[]
[]
[]
[]
[]
[]
[]
[]
[]
[]
[]
[]
[]
[]
[]
[]
[]
[]
[]
[]
[]
[]
[]
[]
[]
[]
[]
[]
[]
[]
[]
[]
[]
[]
[]
[]
[]
[]
[]
[]
[]
[]
[]
[]
[]
[]
[]
[]
[]
[]
[]
[]
[]
[]
[]
[]
[]
[]
[]
[]
[]
[]
[]
[]
[]
[]
[]
[]
[]
[]
[]
[]
[]
[]
[]
[]
[]
[]
[]
[]
[]
[]
[]
[]
[]
[]
[]
[]
[]
[]
[]
[]
[]
[]
[]
[]
[]
[]
[]
[]
[]
[]
[]
[]
[]
[]
[]
[]
[]
[]
[]
[]
[]
[]
[]
[]
[]
[]
[]
[]
[]
[]
[]
[]
[]
[]
[]
[]
[]
[]
[]
[]
[]
[]
[]
[]
[]
[]
[]
[]
[]
[]
[]
[]
[]
[]
[]
[]
[]
[]
[]
[]
[]
[]
[]
[]
[]
[]
[]
[]
[]
[]
[]
[]
[]
[]
[]
[]
[]
[]
[]
[]
[]
[]
[]
[]
[]
[]
[]
[]
[]
[]
[]
[]
[]
[]
[]
[]
[]
[]
[]
[]
[]
[]
[]
[]
[]
[]
[]
[]
[]
[]
[]
[]
[]
[]
[]
[]
[]
[]
[]
[]
[]
[]
[]
[]
[]
[]
[]
[]
[]
[]
[]
[]
[]
[]
[]
[]
[]
[]
[]
[]
[]
[]
[]
[]
[]
[]
[]
[]
[]
[]
[]
[]
[]
[]
[]
[]
[]
[]
[]
[]
[]
[]
[]
[]
[]
[]
[]
[]
[]
[]
[]
[]
[]
[]
[]
[]
[]
[]
[]
[]
[]
[]
[]
[]
[]
[]
[]
[]
[]
[]
[]
[]
[]
[]
[]
[]
[]
[]
[]
[]
[]
[]
[]
[]
[]
[]
[]
[]
[]
[]
[]
[]
[]
[]
[]
[]
[]
[]
[]
[]
[]
[]
[]
[]
[]
[]
[]
[]
[]
[]
[]
[]
[]
[]
[]
[]
[]
[]
[]
[]
[]
[]
[]
[]
[]
[]
[]
[]
[]
[]
[]
[]
[]
[]
[]
[]
[]
[]
[]
[]
[]
[]
[]
[]
[]
[]
[]
[]
[]
[]
[]
[]
[]
[]
[]
[]
[]
[]
[]
[]
[]
[]
[]
[]
[]
[]
[]
[]
[]
[]
[]
[]
[]
[]
[]
[]
[]
[]
[]
[]
[]
[]
[]
[]
[]
[]
[]
[]
[]
[]
[]
[]
[]
[]
[]
[]
[]
[]
[]
[]
[]
[]
[]
[]
[]
[]
[]
[]
[]
[]
[]
[]
[]
[]
[]
[]
[]
[]
[]
[]
[]
[]
[]
[]
[]
[]
[]
[]
[]
[]
[]
[]
[]
[]
[]
[]
[]
[]
[]
[]
[]
[]
[]
[]
[]
[]
[]
[]
[]
[]
[]
[]
[]
[]
[]
[]
[]
[]
[]
[]
[]
[]
[]
[]
[]
[]
[]
[]
[]
[]
[]
[]
[]
[]
[]
[]
[]
[]
[]
[]
[]
[]
[]
[]
[]
[]
[]
[]
[]
[]
[]
[]
[]
[]
[]
[]
[]
[]
[]
[]
[]
[]
[]
[]
[]
[]
[]
[]
[]
[]
[]
[]
[]
[]
[]
[]
[]
[]
[]
[]
[]
[]
[]
[]
[]
[]
[]
[]
[]
[]
[]
[]
[]
[]
[]
[]
[]
[]
[]
[]
[]
[]
[]
[]
[]
[]
[]
[]
[]
[]
[]
[]
[]
[]
[]
[]
[]
[]
[]
[]
[]
[]
[]
[]
[]
[]
[]
[]
[]
[]
[]
[]
[]
[]
[]
[]
[]
[]
[]
[]
[]
[]
[]
[]
[]
[]
[]
[]
[]
[]
[]
[]
[]
[]
[]
[]
[]
[]
[]
[]
[]
[]
[]
[]
[]
[]
[]
[]
[]
[]
[]
[]
[]
[]
[]
[]
[]
[]
[]
[]
[]
[]
[]
[]
[]
[]
[]
[]
[]
[]
[]
[]
[]
[]
[]
[]
[]
[]
[]
[]
[]
[]
[]
[]
[]
[]
[]
[]
[]
[]
[]
[]
[]
[]
[]
[]
[]
[]
[]
[]
[]
[]
[]
[]
[]
[]
[]
[]
[]
[]
[]
[]
[]
[]
[]
[]
[]
[]
[]
[]
[]
[]
[]
[]
[]
[]
[]
[]
[]
[]
[]
[]
[]
[]
[]
[]
[]
[]
[]
[]
[]
[]
[]
[]
[]
[]
[]
[]
[]
[]
[]
[]
[]
[]
[]
[]
[]
[]
[]
[]
[]
[]
[]
[]
[]
[]
[]
[]
[]
[]
[]
[]
[]
[]
[]
[]
[]
[]
[]
[]
[]
[]
[]
[]
[]
[]
[]
[]
[]
[]
[]
[]
[]
[]
[]
[]
[]
[]
[]
[]
[]
[]
[]
[]
[]
[]
[]
[]
[]
[]
[]
[]
[]
[]
[]
[]
[]
[]
[]
[]
[]
[]
[]
[]
[]
[]
[]
[]
[]
[]
[]
[]
[]
[]
[]
[]
[]
[]
[]
[]
[]
[]
[]
[]
[]
[]
[]
[]
[]
[]
[]
[]
[]
[]
[]
[]
[]
[]
[]
[]
[]
[]
[]
[]
[]
[]
[]
[]
[]
[]
[]
[]
[]
[]
[]
[]
[]
[]
[]
[]
[]
[]
[]
[]
[]
[]
[]
[]
[]
[]
[]
[]
[]
[]
[]
[]
[]
[]
[]
[]
[]
[]
[]
[]
[]
[]
[]
[]
[]
[]
[]
[]
[]
[]
[]
[]
[]
[]
[]
[]
[]
[]
[]
[]
[]
[]
[]
[]
[]
[]
[]
[]
[]
[]
[]
[]
[]
[]
[]
[]
[]
[]
[]
[]
[]
[]
[]
[]
[]
[]
[]
[]
[]
[]
[]
[]
[]
[]
[]
[]
[]
[]
[]
[]
[]
[]
[]
[]
[]
[]
[]
[]
[]
[]
[]
[]
[]
[]
[]
[]
[]
[]
[]
[]
[]
[]
[]
[]
[]
[]
[]
[]
[]
[]
[]
[]
[]
[]
[]
[]
[]
[]
[]
[]
[]
[]
[]
[]
[]
[]
[]
[]
[]
[]
[]
[]
[]
[]
[]
[]
[]
[]
[]
[]
[]
[]
[]
[]
[]
[]
[]
[]
[]
[]
[]
[]
[]
[]
[]
[]
[]
[]
[]
[]
[]
[]
[]
[]
[]
[]
[]
[]
[]
[]
[]
[]
[]
[]
[]
[]
[]
[]
[]
[]
[]
[]
[]
[]
[]
[]
[]
[]
[]
[]
[]
[]
[]
[]
[]
[]
[]
[]
[]
[]
[]
[]
[]
[]
[]
[]
[]
[]
[]
[]
[]
[]
[]
[]
[]
[]
[]
[]
[]
[]
[]
[]
[]
[]
[]
[]
[]
[]
[]
[]
[]
[]
[]
[]
[]
[]
[]
[]
[]
[]
[]
[]
[]
[]
[]
[]
[]
[]
[]
[]
[]
[]
[]
[]
[]
[]
[]
[]
[]
[]
[]
[]
[]
[]
[]
[]
[]
[]
[]
[]
[]
[]
[]
[]
[]
[]
[]
[]
[]
[]
[]
[]
[]
[]
[]
[]
[]
[]
[]
[]
[]
[]
[]
[]
[]
[]
[]
[]
[]
[]
[]
[]
[]
[]
[]
[]
[]
[]
[]
[]
[]
[]
[]
[]
[]
[]
[]
[]
[]
[]
[]
[]
[]
[]
[]
[]
[]
[]
[]
[]
[]
[]
[]
[]
[]
[]
[]
[]
[]
[]
[null,{"$f":"Tipla_Mi!$C$26","v":106}]
[]
[]
[null,{"$f":"Tipla_Mi!$G$33","v":15}]
[]
[null,{"$f":"Tipla_Mi!$G$35+Tipla_Mi!$G$37","v":40}]
[]
[null,{"$f":"Tipla_Mi!$G$39","v":22}]
[]
[null,{"$f":"Tipla_Mi!$G$41","v":11}]

{"sheet":"Lager_Schwein","index":2,"n_rows":88,"n_cols":9,"rows_kept":88,"cut":false,"hidden":false,"merged":[[26,0,36,6],[1,5,1,6]]}
["Flüssig- und Festmistanfall für Schweine",null,null,null,null,{"$f":"Deckblatt!H3","v":"Version \"2017-2.8\""},{"$f":"Deckblatt!O31","v":" "}]
["Betrieb:",{"$f":"Deckblatt!E15","v":" "},null,null,"Untern.-Nr.:",{"$f":"Deckblatt!E25","v":160000000000}]
["mitwirkendesUnternehmen:",{"$f":"Deckblatt!E6","v":" "},null,null,"Bearbeiter:",{"$f":"Deckblatt!E8","v":" "}]
[null,null,null,null,null,"Variante:",1]
[null,"Tierplätze","Anzahl","Anzahl","Anzahl","Anfall  in m³","Anfall in m³"]
["Produktionsabschnitt",null,"Tierpl.","Tierpl.","Tierpl.","Gülle/Jauche","Festmist"]
[null,"gesamt","Gülle","Tiefstr.","Flachstr.",1,{"$f":"Betrieb!A6","v":1}]
["Jungsaueneingliederung",null,null,null,null,{"$f":"C8*G53*(F7+5)","v":0},{"$f":"(IF(G7<3,D8*D53,D8*F53)+E8*D53*VLOOKUP(G7,C66:D71,2))*IF(G7=1,G7*1.1,G7)","v":0}]
["95-135 kg",{"$f":"IF(C8+D8+E8=B8,\"\",C8+D8+E8-B8)","v":""},null,null,"",{"$f":"E8*E53*(F7+5)","v":0}]
["Zuchtsauen",null,null,null,null,{"$f":"C10*G51*(F7+5)","v":0},{"$f":"(IF(G7<3,D10*D51,D10*F51)+E10*D51*VLOOKUP(G7,C66:D71,2))*IF(G7=1,G7*1.1,G7)","v":0}]
["ab 1. Belegung",{"$f":"IF(C10+D10+E10=B10,\"\",C10+D10+E10-B10)","v":""},null,null,"",{"$f":"E10*E51*(F7+5)","v":0}]
["Zuchtsauen, laktierend",null,null,null,null,{"$f":"C12*G52*(F7+5)","v":0},{"$f":"(IF(G7<3,D12*D52,D12*F52)+E12*D52*VLOOKUP(G7,C66:D71,2))*IF(G7=1,G7*1.1,G7)","v":0}]
["mit Ferkeln bis 8 kg",{"$f":"IF(C12+D12+E12=B12,\"\",C12+D12+E12-B12)","v":""},null,null,"",{"$f":"E12*E52*(F7+5)","v":0}]
["Aufzuchtferkel",null,null,null,null,{"$f":"C14*G56*(F7+5)","v":0},{"$f":"(IF(G7<3,D14*D56,D14*F56)+E14*D56*VLOOKUP(G7,C66:D71,2))*IF(G7=1,G7*1.1,G7)","v":0}]
[" 8 - 28 kg",{"$f":"IF(C14+D14+E14=B14,\"\",C14+D14+E14-B14)","v":""},null,null,"",{"$f":"E14*E56*(F7+5)","v":0}]
["Eber",null,null,null,null,{"$f":"C16*G54*(F7+5)","v":0},{"$f":"(IF(G7<3,D16*D64,D16*F54)+E16*D54*VLOOKUP(G7,C66:D71,2))*IF(G7=1,G7*1.1,G7)","v":0}]
["ab 50 kg",{"$f":"IF(C16+D16+E16=B16,\"\",C16+D16+E16-B16)","v":""},null,null,null,{"$f":"E16*E54*(F7+5)","v":0}]
["Jungsauenaufzucht",null,null,null,null,{"$f":"C18*G57*(F7+5)","v":0},{"$f":"(IF(G7<3,D18*D57,D18*F57)+E18*D57*VLOOKUP(G7,C66:D71,2))*IF(G7=1,G7*1.1,G7)","v":0}]
["28-95 kg",{"$f":"IF(C18+D18+E18=B18,\"\",C18+D18+E18-B18)","v":""},null,null,"",{"$f":"E18*E57*(F7+5)","v":0}]
["Mastschweine 28-115kg",null,null,null,null,{"$f":"C20*G59*(F7+5)","v":0},{"$f":"(IF(G7<3,D20*D59,D20*F59)+E20*D59*VLOOKUP(G7,C66:D71,2))*IF(G7=1,G7*1.1,G7)","v":0}]
["Trockenfütterung",{"$f":"IF(C20+D20+E20=B20,\"\",C20+D20+E20-B20)","v":""},null,null,null,{"$f":"(E20*E59)*(F7+5)","v":0}]
["Mastschweine 28-115kg",null,null,null,null,{"$f":"G60*C22*(F7+5)","v":0},{"$f":"(IF(G7<3,D22*D60,D22*F60)+E22*D60*VLOOKUP(G7,C66:D71,2))*IF(G7=1,G7*1.1,G7)","v":0}]
["Flüssigfütterung",{"$f":"IF(C22+D22+E22=B22,\"\",C22+D22+E22-B22)","v":""},null,null,null,{"$f":"(E22*E60)*(F7+5)","v":0}]
["Summe Schweine",{"$f":"B8+B10+B12+B14+B16+B18+B20+B22","v":0},null,null,null,{"$f":"SUM(F8:F23)","v":0},{"$f":"SUM(G22,G18,G14,G20,G12,G10,G8,G16)","v":0}]
[]
["Kommentar:"]
[]
[]
[]
[]
[]
[]
[]
[]
[]
[]
[]
[]
[]
[]
[]
[null,null,null,null,null,null,null,null," "]
[]
[]
[]
[]
[]
[]
[null,null,"Frischmist","Frischmist",null,"Tiefstreu"]
[null,null,"t/Tier","Dung","Jauche","Dung","Gülle"]
["Zuchtsauen ab 1. Belegung",0.3,0.24,0.27,0.08,0.2,0.28000000000000003,null,{"$f":"G51/B51","v":0.93333333333333346}]
["Zuchtsauen laktierend",0.05,0.49,0.54,0.18,0.4,0.53,null,{"$f":"G52/B52","v":10.6}]
[" Jungsaueneingliederung",0.23,0.155,0.17,8.3000000000000004E-2,0.15,0.21,null,{"$f":"G53/B53","v":0.91304347826086951}]
["Eber ab 50 kg",0.3,0.15,0.17,0.125,0.3,0.3,null,{"$f":"G54/B54","v":1}]
[]
[" Ferkel 8 bis 28 kg  ",0.03,3.1E-2,3.4000000000000002E-2,2.5000000000000001E-2,0.03,0.05,null,{"$f":"G56/B56","v":1.6666666666666667}]
["Jungsauenaufzucht 28-95 kg ",7.0000000000000007E-2,0.115,0.13,0.05,0.13,0.15,null,{"$f":"G57/B57","v":2.1428571428571428}]
[]
["Mastschweine 28- 115 kg Trockenfütterung",0.13,0.09,0.1,0.05,0.1,0.13300000000000001,null,{"$f":"G59/B59","v":1.023076923076923}]
["Mastschweine 28 - 115 kg Flüssigfütterung",0.13,0.09,0.1,0.06,0.1,0.16300000000000001]
[]
[null,"Trocken- oder Breifutter mit Tränke im Trog"]
[null,"Flüssigfütterung und/oder Tränke in der Bucht"]
["33 Tage"]
["2 Monate"]
["3 Monate","ja",1,1]
["4 Monate","nein",2,1]
["5 Monate",null,3,0.86599999999999999]
["6 Monate",null,4,0.8]
["7 Monate",null,5,0.76]
["8 Monate",null,6,0.73]
["9 Monate"]
["10 Monate"]
["11 Monate"]
["12 Monate"]
[]
[]
[]
[]
[]
[]
[]
[]
[null,null,null,"Rundbehälter",null,"20 cm Strohhäcksel"]
[null,null,null,"Rechteckbeh.",null,"10 cm Strohhäcksel",null,"ja"]
[null,null,null,"Re.-Trapezbeh.",null,"Pegülith",null,"nein"]
[null,null,null,"Staukanal",null,"nat. Schwimmdecke"]
[null,null,null,"Güllekeller",null,"wasserdichter Abd."]

{"sheet":"Coferm","index":3,"n_rows":57,"n_cols":9,"rows_kept":57,"cut":false,"hidden":false,"merged":[[0,7,0,8],[1,6,1,8],[2,6,2,8],[48,0,48,8],[38,7,40,8],[50,7,50,8],[56,7,56,8],[51,7,51,8],[52,7,52,8],[53,7,53,8],[54,7,54,8],[55,7,55,8]]}
["Wirtschaftsdüngeranfall aus Kofermenten",null,null,null,null,null,{"$f":"Deckblatt!H3","v":"Version \"2017-2.8\""},{"$f":"Deckblatt!O31","v":" "}]
["Betrieb:",null,{"$f":"Deckblatt!E15","v":" "},null,null,"Untern.-Nr.:",{"$f":"Deckblatt!E25","v":160000000000}]
["mitwirk. Unternehmen:",null,{"$f":"Deckblatt!E6","v":" "},null,null,"Bearbeiter:",{"$f":"Deckblatt!E8","v":" "}]
["Kofermente 1)",null,"TS in %","Einheit","Menge je Jahr in t","Fugat in m³/ t Koferment","Fugat / Jahr in m³"]
["Festmist frisch",null,25,"t",null,0.93,{"$f":"F5*E5","v":0}]
["Trockenkot (Geflügel)",null,60,"t",null,0.76,{"$f":"F6*E6","v":0}]
["Maissilage",null,32,"t",null,0.76,{"$f":"F7*E7","v":0}]
["Gras- / Ganzpflanzensilage",null,40,"t",null,0.75230357142857152,0]
["Lieschkolbensilage LKS",null,45,"t",null,0.6302928571428571,0]
["Getreide (Körner), Rapssaat",null,87,"t",null,0.24886964285714275,0]
["CornCrobMix",null,65,"t",null,0.45,0]
["Zuckerrüben",null,23,"t",null,0.79965535714285718,0]
["Futterrüben",null,15,"t",null,0.9,0]
["Kartoffeln",null,22,"t",null,0.8,0]
["Grünmais",null,28,"t",null,0.79759999999999998,0]
["Kleegras",null,17,"t",null,0.89556785714285714,0]
["Rotklee Pflanze",null,20,"t",null,0.88138571428571433,0]
["Wiesengras",null,20,"t",null,0.86721785714285715,0]
["Raps Ganzpflanze",null,14,"t",null,0.90264999999999995,0]
["Zuckerhirse, Sudangras",null,18,"t",null,0.89,0]
["Stroh",null,86,"t",null,0.6,0]
["Wiesenheu",null,86,"t",null,0.47912857142857146,0]
["Kartoffelschlempe frisch",null,7,"t",null,1,0]
["Altbrot",null,65,"t",null,0.37,{"$f":"F24*E24","v":0}]
["Backabfälle",null,87,"t",null,0.15253749999999988,0]
["Bierhefe",null,10,"t",null,0.92745357142857143,0]
["Biertreber",null,24,"t",null,0.85033214285714287,0]
["Kartoffelflocken, -schrot",null,88,"t",null,0.25567321428571432,0]
["Kartoffelpreßpülpe",null,18,"t",null,0.8392857142857143,0]
["Kartoffelschälabfall",null,11,"t",null,0.90977857142857144,0]
["Leinenextraktionsschrot",null,88,"t",null,0.36329821428571418,0]
["Magermilch, Molke",null,8,"t",null,1,0]
["Malzkeime",null,92,"t",null,0.42167500000000002,0]
["Melasse",null,77,"t",null,0.39148571428571433,0]
["Milchzuckermelasse",null,30,"t",null,0.79392142857142856,0]
["Molke teilentzu. Trocken",null,95,"t",null,0.32866428571428563,0]
["Obsttrester Apfel",null,22,"t",null,0.85937142857142856,0]
["Rapsextraktionsschrot",null,88,"t",null,0.42807142857142855,0]
["Rapskuchen kaltpr. 15 % Fett",null,91,"t",null,0.34570714285714277,0,"Berechnung eigener Fugatfaktoren"]
["Weizenkleie",null,88,"t",null,0.44842857142857151,{"$f":"F40*E40","v":0}]
["Weizennachmehl",null,88,"t",null,0.25308035714285715,0]
["Zuckerrübennaßschnitzel",null,13,"t",null,0.9053714285714286,0,"Gas-","Methan-"]
["Zuckerrübenpreßschnitzel",null,20,"t",null,0.83308571428571432,0,"ertrag","gehalt"]
["Zuckerrübentrockenschnitzel",null,91,"t",null,0.18800714285714282,0,"in m³/t","in %"]
["eigenes Substrat",null,null,"t",null,{"$f":"IF(1-((I45*16+(100%-I45)*44)*(1000/22.4)*H45/1000000)<0,0,1-((I45*16+(100%-I45)*44)*(1000/22.4)*H45/1000000))","v":1},0]
["eigenes Substrat",null,null,"t",null,{"$f":"IF(1-((I46*16+(100%-I46)*44)*(1000/22.4)*H46/1000000)<0,0,1-((I46*16+(100%-I46)*44)*(1000/22.4)*H46/1000000))","v":1},0]
["eigenes Substrat",null,null,"t",null,{"$f":"IF(1-((I47*16+(100%-I47)*44)*(1000/22.4)*H47/1000000)<0,0,1-((I47*16+(100%-I47)*44)*(1000/22.4)*H47/1000000))","v":1},0]
["Summe",null,null,null,null,null,{"$f":"SUM(G5:G47)","v":0}]
["1) Bei überwiegender Vergärung von Substraten mit hohem Trockensubstanzgehalt kann es erforderlich sein, Prozesswasser einzusetzen. Dieses Prozesswasser ist bei der Berechnung der Lagerkapazität zusätzlich zu berücksichtigen."]
["Gülle-/Gärrestseparation"]
["Inputmaterial in m³ je Jahr"," TS-Gehalt Inputmaterial in  %","TS-Gehalt Feststoffe in %","TS-Gehalt Flüssig-phase in %","Abscheide- grad in %","Flüssigphase in m³ je Jahr","Feststoffe in t je Jahr","Feststoffe in m³ je Jahr"]
[null,null,null,null,{"$f":"IF(A52=\"\",\"\",(B52-D52)/(C52-D52))","v":""},{"$f":"IF(A52=\"\",\"\",A52-G52)","v":""},{"$f":"IF(A52=\"\",\"\",A52*(B52-D52)/(C52-D52))","v":""},{"$f":"IF(A52=\"\",\"\",G52/0.75)","v":""}]
[null,null,null,null,{"$f":"IF(A53=\"\",\"\",(B53-D53)/(C53-D53))","v":""},{"$f":"IF(A53=\"\",\"\",A53-G53)","v":""},{"$f":"IF(A53=\"\",\"\",A53*(B53-D53)/(C53-D53))","v":""},{"$f":"IF(A53=\"\",\"\",G53/0.75)","v":""}]
[null,null,null,null,"",{"$f":"IF(A54=\"\",\"\",A54-G54)","v":""},{"$f":"IF(A54=\"\",\"\",A54*(B54-D54)/(C54-D54))","v":""},{"$f":"IF(A54=\"\",\"\",G54/0.75)","v":""}]
[null,null,null,null,"",{"$f":"IF(A55=\"\",\"\",A55-G55)","v":""},{"$f":"IF(A55=\"\",\"\",A55*(B55-D55)/(C55-D55))","v":""},{"$f":"IF(A55=\"\",\"\",G55/0.75)","v":""}]
[null,null,null,null,"",{"$f":"IF(A56=\"\",\"\",A56-G56)","v":""},{"$f":"IF(A56=\"\",\"\",A56*(B56-D56)/(C56-D56))","v":""},{"$f":"IF(A56=\"\",\"\",G56/0.75)","v":""}]
[{"$f":"SUM(A52:A56)","v":0},null,null,null,null,{"$f":"SUM(F52:F56)","v":0},{"$f":"SUM(G52:G56)","v":0},{"$f":"SUM(H52:H56)","v":0}]

{"sheet":"Betrieb","index":4,"n_rows":112,"n_cols":22,"rows_kept":112,"cut":false,"hidden":false,"merged":[[70,8,70,9],[32,1,32,10],[6,6,6,8],[1,8,1,9],[21,6,21,7],[27,6,27,7],[67,0,68,10],[34,8,34,9],[3,8,3,9]]}
["Berechnung der Festmistlagerkapazität für den Gesamtbetrieb",null,null,null,null,null,null,null,null,null,{"$f":"Deckblatt!H3","v":"Version \"2017-2.8\""}]
["Betrieb:",{"$f":"Deckblatt!E15","v":" "},null,null,null,null,"Untern.-Nr.:",null,{"$f":"Deckblatt!E25","v":160000000000},null,{"$f":"Deckblatt!O31","v":" "}]
["mitwirk. Unternehmen:",{"$f":"Deckblatt!E6","v":" "},null,null,null,null,"Bearbeiter:",null,{"$f":"Deckblatt!E8","v":" "}]
["Jahresniederschlag in mm",null,"(langjähriges Mittel)",null,null,{"$f":"Deckblatt!O33","v":1000},"Variante:",null," "]
["Anfall an Festmist für","Rinder",null,null,null,null,"Schweine"]
[1,"Schafe",null,null,null,null,"Ziegen"]
[null,"Pferde",null,null,null,null,"Mehr-/ Minderanfall"]
[null,null,null,null,null,"Summe Anfall",null,null,null,{"$f":"SUM(E5:E7)+J5+J6+J7","v":0},"m³"]
["Vorhandene Läger","Anzahl","Länge","Breite","od. altern.","Stapelhöhe","Lagerung","Schiebefl.","Kapazität","Oberfl.-","Zuordnung",null,null,"tägl. Anfall","Lager Stall","Kap sonst","Anf","Tage Stall",{"$f":"I20/(J8/(A6*IF(A6=1,33,30)))","v":{"$error":"#DIV/0!"}}]
["(incl.Tiefstreu im Stall)","Behält.","in m","in m","Fläche i. m²","in m","Überdachung","in m²","in m³","wasser m³","Lagerstätte",null,null,{"$f":"E5/(A6*IF(A6=1,33,30))","v":0},{"$f":"SUMIFS(I$11:I$19,G$11:G$19,3,K$11:K$19,1)","v":0},{"$f":"SUMIFS(I$11:I$19,G$11:G$19,1,K$11:K$19,1)+SUMIFS(I$11:I$19,G$11:G$19,2,K$11:K$19,1)","v":0},{"$f":"IF(R10<A6*IF(A6=1,33,30),E5,0)","v":0},{"$f":"IF(E5=0,0,IF(A6=1,O10/(E5/(A6*33)),O10/(E5/(A6*30))))","v":0},"Rinder"]
[null,null,null,null,null,null,2,null,{"$f":"IF(E11=0,C11*D11*F11*B11,E11*F11*B11)","v":0},{"$f":"IF(G11=2,IF(E11=0,(B11*C11*D11+H11)*$F$4/1000*($A$41+5)*30/360*0.7,(B11*E11+H11)*$F$4/1000*($A$41+5)*30/360*0.7),H11*$F$4/1000*($A$41+5)*30/360*0.7)","v":0},6,null,null,{"$f":"J5/(A6*IF(A6=1,33,30))","v":0},{"$f":"SUMIFS(I$11:I$19,G$11:G$19,3,K$11:K$19,2)","v":0},{"$f":"SUMIFS(I$11:I$19,G$11:G$19,1,K$11:K$19,2)+SUMIFS(I$11:I$19,G$11:G$19,2,K$11:K$19,2)","v":0},{"$f":"IF(R11<A6*IF(A6=1,33,30),J5,0)","v":0},{"$f":"IF(J5=0,0,O11/(J5/(A6*IF(A6=1,33,30))))","v":0},"Schweine"]
[null,null,null,null,null,null,2,null,0,0,6,null,null,{"$f":"E6/(A6*IF(A6=1,33,30))","v":0},{"$f":"SUMIFS(I$11:I$19,G$11:G$19,3,K$11:K$19,3)","v":0},{"$f":"SUMIFS(I$11:I$19,G$11:G$19,1,K$11:K$19,3)+SUMIFS(I$11:I$19,G$11:G$19,2,K$11:K$19,3)","v":0},{"$f":"IF(R12<A6*IF(A6=1,33,30),E6,0)","v":0},{"$f":"IF(E6=0,0,O12/(E6/(A6*IF(A6=1,33,30))))","v":0},"Schafe"]
[null,null,null,null,null,null,2,null,0,{"$f":"IF(G13=2,IF(E13=0,(B13*C13*D13+H13)*$F$4/1000*($A$41+5)*30/360*0.7,(B13*E13+H13)*$F$4/1000*($A$41+5)*30/360*0.7),H13*$F$4/1000*($A$41+5)*30/360*0.7)","v":0},6,null,null,{"$f":"J6/(A6*IF(A6=1,33,30))","v":0},{"$f":"SUMIFS(I$11:I$19,G$11:G$19,3,K$11:K$19,4)","v":0},{"$f":"SUMIFS(I$11:I$19,G$11:G$19,1,K$11:K$19,4)+SUMIFS(I$11:I$19,G$11:G$19,2,K$11:K$19,4)","v":0},{"$f":"IF(R13<A6*IF(A6=1,33,30),J6,0)","v":0},{"$f":"IF(J6=0,0,O13/(J6/(A6*IF(A6=1,33,30))))","v":0},"Ziegen"]
[null,null,null,null,null,null,2,null,0,0,6,null,null,{"$f":"E7/(A6*IF(A6=1,33,30))","v":0},{"$f":"SUMIFS(I$11:I$19,G$11:G$19,3,K$11:K$19,5)","v":0},{"$f":"SUMIFS(I$11:I$19,G$11:G$19,1,K$11:K$19,5)+SUMIFS(I$11:I$19,G$11:G$19,2,K$11:K$19,5)","v":0},{"$f":"IF(R14<A6*IF(A6=1,33,30),E7,0)","v":0},{"$f":"IF(E7=0,0,O14/(E7/(A6*IF(A6=1,33,30))))","v":0},"Pferde"]
[null,null,null,null,null,null,2,null,0,0,6,null,null,null,null,null,null,0,"alle Kategorien"]
[null,null,null,null,null,null,2,null,0,0,6,null,null,{"$f":"SUM(N10:N14)","v":0},{"$f":"SUMIFS(I$11:I$19,G$11:G$19,1,K$11:K$19,6)+SUMIFS(I$11:I$19,G$11:G$19,2,K$11:K$19,6)","v":0},{"$f":"SUMIFS(I$11:I$19,G$11:G$19,1,K$11:K$19,6)+SUMIFS(I$11:I$19,G$11:G$19,2,K$11:K$19,6)","v":0},{"$f":"SUM(Q10:Q14)+J7","v":0},{"$f":"IF(Q16=0,0,O17/(Q16/(A6*IF(A6=1,33,30))))","v":0},"alle Kategorien"]
[null,null,null,null,null,null,2,null,0,0,6,null,null,null,{"$f":"I20-SUMIFS(O10:O16,Q10:Q16,0)","v":0},{"$f":"SUM(P10:P16)","v":0},{"$f":"Q16/(A6*IF(A6=1,33,30))","v":0},{"$f":"IF(Q17=0,0,O17/Q17)","v":0},"Summe"]
[null,null,null,null,null,null,2,null,0,0,6,null,null,null,null,null,"Tage Stall Min",{"$f":"MIN(IF(R10:R15>0,R10:R15))","v":0}]
[null,null,null,null,null,null,2,null,0,0,6,null,null,null,null,null,"Tage 1",{"$f":"IF(AND(R17>0,R17<S9),R17,S9)","v":{"$error":"#DIV/0!"}}]
["Summe",null,null,null,null,null,null,null,{"$f":"SUM(I11:I19)","v":0},{"$f":"SUM(J11:J19)","v":0},null,null,null,null,null,null,"Tage 2",{"$f":"IF(AND(R17=0,Q17>0),0,R19)","v":{"$error":"#DIV/0!"}}]
["Die Lagerkapazität für Festmist von Huf- u. Klauentieren ist ausreichend für:",null,null,null,null,null,{"$f":"IF(J8>0,R20,\"\")","v":""},"Tage =",{"$f":"IF(G21=\"\",\"\",(G21/30))","v":""},"Monate"]
[2,"Geflügel / Kaninchen",null,null,null,null,"Mehr-/Minderanfall",null,null,{"$f":"E22+I22","v":0}]
[null,null,null,null,null,null,2,null,{"$f":"IF(E23=0,C23*D23*F23*B23,E23*F23*B23)","v":0},{"$f":"IF(G23=2,IF(E23=0,(B23*C23*D23+H23)*$F$4/1000*($A$41+5)*30/360*0.7,(B23*E23+H23)*$F$4/1000*($A$41+5)*30/360*0.7),H23*$F$4/1000*($A$41+5)*30/360*0.7)","v":0},null,null,null,null,null,null,null,null,null,"Dungpl.","OF-wasser"]
[null,null,null,null,null,null,2,null,{"$f":"IF(E24=0,C24*D24*F24*B24,E24*F24*B24)","v":0},{"$f":"IF(G24=2,IF(E24=0,(B24*C24*D24+H24)*$F$4/1000*($A$41+5)*30/360*0.7,(B24*E24+H24)*$F$4/1000*($A$41+5)*30/360*0.7),H24*$F$4/1000*($A$41+5)*30/360*0.7)","v":0},null,null,{"$f":"SUMIF(G11:G19,1,I11:I19)","v":0},null,null,null,null,null,null,{"$f":"SUMIF(G11:G19,2,I11:I19)","v":0},{"$f":"H20+I58+J58","v":0}]
[null,null,null,null,null,null,2,null,{"$f":"IF(E25=0,C25*D25*F25*B25,E25*F25*B25)","v":0},{"$f":"IF(G25=2,IF(E25=0,(B25*C25*D25+H25)*$F$4/1000*($A$41+5)*30/360*0.7,(B25*E25+H25)*$F$4/1000*($A$41+5)*30/360*0.7),H25*$F$4/1000*($A$41+5)*30/360*0.7)","v":0}]
["Summe",null,null,null,null,null,null,null,{"$f":"SUM(I23:I25)","v":0},{"$f":"SUM(J23:J25)","v":0},null,null,null,null,null,null,null,null,null,null,"Silowasser"]
["Die Lagerkapazität für Geflügelfestmist  ist ausreichend für:",null,null,null,null,null,{"$f":"IF(J22>0,I26/(J22/((A22+3)*30)),\"\")","v":""},"Tage =",{"$f":"IF(G27=\"\",\"\",(G27/30))","v":""},"Monate",null,null,null,null,null,null,null,null,null,null,{"$f":"IF(J38>0,Lager_Ri!$N$15,0)","v":0}]
[1,"Gülle-/Gärrestfeststoffe",null,null,null,null,"Mehr-/Minderanfall",null,null,{"$f":"E28+I28","v":0},null,null,null,null,null,null,null,null,null,null,"sickersaft"]
[null,null,null,null,null,null,2,null,{"$f":"IF(E29=0,C29*D29*F29*B29,E29*F29*B29)","v":0},{"$f":"IF(G29=2,IF(E29=0,(B29*C29*D29+H29)*$F$4/1000*($A$41+5)*30/360*0.7,(B29*E29+H29)*$F$4/1000*($A$41+5)*30/360*0.7),H29*$F$4/1000*($A$41+5)*30/360*0.7)","v":0},null,null,{"$f":"IF(G30=1,I30,0)","v":0},null,null,null,null,null,null,{"$f":"IF(G30=2,I30,0)","v":0},{"$f":"IF(J38>0,Lager_Ri!$O$15,0)","v":0}]
[null,null,null,null,null,null,2,null,{"$f":"IF(E30=0,C30*D30*F30*B30,E30*F30*B30)","v":0},{"$f":"IF(G30=2,IF(E30=0,(B30*C30*D30+H30)*$F$4/1000*($A$41+5)*30/360*0.7,(B30*E30+H30)*$F$4/1000*($A$41+5)*30/360*0.7),H30*$F$4/1000*($A$41+5)*30/360*0.7)","v":0}]
["Summe",null,null,null,null,null,null,null,{"$f":"SUM(I29:I30)","v":0},{"$f":"SUM(J29:J30)","v":0}]
["Die Lagerkapazität für Gülle- und Gärrestfeststoffe ist ausreichend für:",null,null,null,null,null,{"$f":"IF(J28>0,I31/(J28/((A28+5)*30)),\"\")","v":""},"Tage =",{"$f":"IF(G32=\"\",\"\",(G32/30))","v":""},"Monate"]
["Kommentar:"]
["Berechnung der Flüssigmistlagerkapazität für den Gesamtbetrieb",null,null,null,null,null,null,null,null,null,{"$f":"Deckblatt!H3","v":"Version \"2017-2.8\""}]
["Betrieb:",{"$f":"B2","v":" "},null,null,null,null,"Untern.-Nr.:",null,{"$f":"I2","v":160000000000},null,{"$f":"K2","v":" "}]
["mitwirk. Unternehen:",{"$f":"Deckblatt!E6","v":" "},null,null,null,null,"Bearbeiter:",null,{"$f":"Deckblatt!E8","v":" "}]
["Jahresniederschlag in mm (langjähriges Mittel)",null,null,{"$f":"F4","v":1000},null,null,"Variante:",null,{"$f":"I4","v":" "}]
["Anfall an","Rinder",null,null,null,"Silagesickersaft  d. Siloanlagen"]
["Flüssigmist","Schweine",null,null,null,"Gülle-/Gärrest flüssige Phase"]
["für","Geflügel",null,null,null,"Mehr- oder Minderanfall"]
[1,"Schafe/Pferde",null,null,null,"Summe Anfall",null,null,null,{"$f":"SUM(D38:D41,J38,J39)+J40","v":0}]
[null,null,null,null,null,"Niederschlag auf die Dunglager",null,null,null,{"$f":"(J20+J26+J31)","v":0}]
[]
["vorhandene Lagerkapazität"]
["Name Lager","Anzahl","Behälter-","Art d.","Pumpensumpf","Oberfläche","Grundfläche","Behälterh.","Abfüll-","sonst.einm.","Lagerraum","Volumen","Volumen","Behälterh.","Trapez-"]
[null,"Behält.","form","Abdeckung","Restfüllstand","o. Durchmesser","in m²","in m","fläche m²","Flächen m²","netto* in m³","gesamt","verfügbar","verfügbar","behölter","Regenwasser",null,"wasserdicht",1,0.1,"Summe Abdeck","Regenwasser"]
[null,null,1,2,5,null,null,null,null,null,{"$f":"B47*IF(C47=1,(F47/2)*(F47/2)*PI()*N47-P47,IF(C47=2,F47*N47-P47,IF(C47=3,O47-P47,IF(C47=4,F47*N47,IF(E47=1,F47*(H47-0.1),F47*(H47-0.25))))))","v":0},{"$f":"B47*IF(C47=1,IF(E47=1,(F47/2)*(F47/2)*PI()*(H47),(F47/2)*(F47/2)*PI()*(H47)),IF(C47=2,IF(E47=1,F47*(H47),F47*(H47)),IF(C47=3,(F47+SQRT(F47*G47)+G47)*H47/3,IF(C47=4,F47*H47,IF(E47=1,F47*(H47),F47*(H47))))))","v":0},{"$f":"B47*IF(C47=1,(F47/2)*(F47/2)*PI()*(N47),IF(C47=2,F47*N47,IF(C47=3,O47,IF(C47=4,F47*N47,F47*N47))))","v":0},{"$f":"IF(H47=0,0,IF(C47=5,H47-0.1-VLOOKUP(E47,S$51:T$55,2),H47-VLOOKUP(D47,S$46:T$49,2)-VLOOKUP(E47,S$51:T$55,2)))","v":0},{"$f":"IF(C47=3,(F47+G47+SQRT(F47*G47))*H47/3-IF(E47=1,F47*0.2,F47*0.2+G47*0.15),0)","v":0},{"$f":"IF(D47=2,IF(C47=1,(F47/2)*(F47/2)*PI()*$D$37/1000*0.7*($A$41+5)*30/360,F47*$D$37/1000*0.7*($A$41+5)*30/360),0)","v":0},null,"wasserdurchl.",2,0.2,{"$f":"IF(B47=0,0,IF(C47=1,B47*(F47/2)*(F47/2)*PI()*IF(D47=2,0.15,IF(D47=3,0.075,IF(D47=4,0.1,0))),IF(OR(C47=2,C47=3),B47*F47*IF(D47=2,0.15,IF(D47=3,0.075,IF(D47=4,0.1,0))),0)))","v":0},{"$f":"IF(D47=2,IF(C47=1,B47*(F47/2)*(F47/2)*PI()*$D$37/1000*0.7*($A$41+5)*30/360,B47*F47*$D$37/1000*0.7*($A$41+5)*30/360),0)","v":0}]
[null,null,1,2,5,null,null,null,null,null,0,{"$f":"B48*IF(C48=1,IF(E48=1,(F48/2)*(F48/2)*PI()*(H48),(F48/2)*(F48/2)*PI()*(H48)),IF(C48=2,IF(E48=1,F48*(H48),F48*(H48)),IF(C48=3,(F48+SQRT(F48*G48)+G48)*H48/3,IF(C48=4,F48*H48,IF(E48=1,F48*(H48),F48*(H48))))))","v":0},0,0,0,0,"Staukanal","gasdicht 35 cm",3,0.35,0,{"$f":"IF(D48=2,IF(C48=1,B48*(F48/2)*(F48/2)*PI()*$D$37/1000*0.7*($A$41+5)*30/360,B48*F48*$D$37/1000*0.7*($A$41+5)*30/360),0)","v":0}]
[null,null,1,2,5,null,null,null,null,null,0,{"$f":"B49*IF(C49=1,IF(E49=1,(F49/2)*(F49/2)*PI()*(H49),(F49/2)*(F49/2)*PI()*(H49)),IF(C49=2,IF(E49=1,F49*(H49),F49*(H49)),IF(C49=3,(F49+SQRT(F49*G49)+G49)*H49/3,IF(C49=4,F49*H49,IF(E49=1,F49*(H49),F49*(H49))))))","v":0},0,0,0,0,{"$f":"SUMIF(C47:C56,4,K47:K56)","v":0},"gasdicht 50 cm",4,0.5,0,0]
[null,null,1,2,5,null,null,null,null,null,0,0,0,0,0,0,"Staukanal brutto",null,null,null,0,0]
[null,null,1,2,5,null,null,null,null,null,0,0,0,0,0,0,{"$f":"SUMIF(C47:C56,4,L47:L56)","v":0},"Pumpensumpf",1,0,0,0]
[null,null,1,2,5,null,null,null,null,null,0,0,0,0,0,0,"Summe Anfall","15 cm Restfüllst.",2,0.15,0,0]
[null,null,1,2,5,null,null,null,null,null,0,0,0,0,0,0,{"$f":"(SUM(D38:D41)-IF(D38>0,(Lager_Ri!$G$10),0)-IF(D41>0,(Lager_Schaf!$F$8)+(Lager_Schaf!$F$20),0))/(($A$41+5)*30)","v":0},"25 cm Restfüllst.",3,0.25,0,0]
[null,null,1,2,5,null,null,null,null,null,0,0,0,0,0,0,null,"50 cm Restfüllst.",4,0.5,0,0]
[null,null,1,2,5,null,null,null,null,null,0,0,0,0,0,0,null,"1 m Restfüllst.",5,1,0,0]
[null,null,1,2,5,null,null,null,null,null,0,0,0,0,0,0,null,null,null,null,0,0]
["Summe Behälter aus Anlage",{"$f":"B93","v":0},null,null,null,null,null,null,{"$f":"I93","v":0},{"$f":"J93","v":0},{"$f":"K93","v":0},{"$f":"L93","v":0},{"$f":"M93","v":0},null,null,{"$f":"P93","v":0},null,null,null,null,{"$f":"Q93","v":0},{"$f":"R93","v":0}]
["Summe",{"$f":"SUM(B47:B57)","v":0},null,null,null,null,null,null,{"$f":"(SUM(I47:I56)+I62)*($F$4/1000*($A$41+5)*30/360*0.7)+I57","v":0},{"$f":"(SUM(J47:J56)+J62)*($F$4/1000*($A$41+5)*30/360*0.7)+J57","v":0},{"$f":"SUM(K47:K57)","v":0},{"$f":"SUM(L47:L57)","v":0},{"$f":"SUM(M47:M57)","v":0},null,null,{"$f":"SUM(P47:P57)","v":0},null,null,null,null,{"$f":"SUM(U47:U57)","v":0},{"$f":"SUM(V47:V57)","v":0}]
[{"$f":"IF(K58>J41+J42+I58+J58,\"freie Lagerkapazität für Flüssigmist in m³\",\"neu zu errichtende Lagerkapazität für Flüssigmist in m³\")","v":"neu zu errichtende Lagerkapazität für Flüssigmist in m³"},null,null,null,null,null,{"$f":"IF(K58>(J41+J42+I58+J58),K58-J41-I58-J58-J42,J41+J42+J58+I58-K58)","v":0},null,null,null,null,null,null,null,null,null,null,"Rundbeh."]
[null,"Anzahl","Behälter-","Art d.","Pumensumpf","Oberfläche","Grundfläche","Behälterh.","Abfüll-","sonst.einm.","Kapazität","Volumen","Volumen","nutzb.",null,null,null,"Rechteckbeh."]
[null,"Behält.","form","Abdeckung","Restfüllstand","o. Durchm.","in m²","in m","fläche m²","Flächen m²","netto in m³","gesamt","nutzbar","Behälterh.",null,null,null,"Re.-Trapez.",null,"OF-wasser"]
["Vorschlag neuer Behälter",{"$f":"B63","v":0},1,2,5,{"$f":"IF(OR(B63=0,H63=0),0,IF(K58+I58+J58<J41+J42,IF(C62=1,SQRT(G59/B62/N62/PI())*2,IF(C62=2,G59/B62/N62,IF(E62=2,IF(D62=1,(SQRT(G59/B62/N62)+H62)*(SQRT(G59/B62/N62)+H62),(SQRT(G59/B62/N62)+H62+F4/1000*0.35)*(SQRT(G59/B62/N62)+H62+F4/1000*0.35)),IF(D62=1,(SQRT(G59/B62/N62)+H62+0.15)*(SQRT(G59/B62/N62)+H62+0.15),(SQRT(G59/B62/N62)+H62+F4/1000*0.35+0.15)*(SQRT(G59/B62/N62)+H62+F4/1000*0.35+0.15))))),0))","v":0},{"$f":"IF(OR(B63=0,H63=0),0,IF(C62=3,IF(E62=2,IF(D62=1,(SQRT(G59/B62/N62)-H62)*(SQRT(G59/B62/N62)-H62),(SQRT(G59/B62/N62)-H62+F4/1000*0.35)*(SQRT(G59/B62/N62)-H62+F4/1000*0.35)),IF(D62=1,(SQRT(G59/B62/N62)-H62+0.15)*(SQRT(G59/B62/N62)-H62+0.15),(SQRT(G59/B62/N62)-H62+F4/1000*0.35+0.15)*(SQRT(G59/B62/N62)-H62+F4/1000*0.35+0.15))),\"\"))","v":0},{"$f":"H63","v":0},{"$f":"I63","v":0},{"$f":"J63","v":0},{"$f":"B62*IF(C62=1,(F62/2)*(F62/2)*PI()*N62,IF(C62=2,F62*N62,IF(C62=3,O62-P62,IF(C62=4,F62*H62*N62,IF(E62=1,F62*(H62-0.1),F62*(H62-0.25))))))","v":0},{"$f":"B62*IF(C62=1,IF(E62=1,(F62/2)*(F62/2)*PI()*(H62),(F62/2)*(F62/2)*PI()*(H62)),IF(C62=2,IF(E62=1,F62*(H62),F62*(H62)),IF(C62=3,(F62+SQRT(F62*G62)+G62)*H62/3,IF(C62=4,F62*H62,IF(E62=1,F62*(H62),F62*(H62))))))","v":0},{"$f":"B62*IF(C62=1,(F62/2)*(F62/2)*PI()*N62+P62,IF(C62=2,F62*N62+P62,IF(C62=3,O62,IF(C62=4,F62*H62*0.8,F62*N62))))","v":0},{"$f":"IF(H62=0,0,IF(D62=2,H62-0.2-VLOOKUP(E62,S$51:T$55,2)-$D$37/1000*($A$41+5)*30/360*0.7,H62-VLOOKUP(D62,S$46:T$49,2)-VLOOKUP(E62,S$51:T$55,2)))","v":0},{"$f":"IF(C62=3,(F62+G62+SQRT(F62*G62))*H62/3-IF(E62=1,F62*0.2,F62*0.2+G62*0.15),0)","v":0},{"$f":"IF(OR(D62=1,D62=3,D62=4,H62=\"\"),0,IF(C62=1,(F62/2)*(F62/2)*PI()*$D$37/1000*0.7*($A$41+5)*30/360,IF(OR(C62=2,C62=3),F62*$D$37/1000*0.7*($A$41+5)*30/360,0)))","v":0},null,"Staukanal",null,{"$f":"IF(B63=0,0,($F$4/1000*($A$41+5)*30/360*0.7)*(J62+I62))","v":0},null,{"$f":"IF(B62=0,0,IF(D62=2,IF(C62=1,B62*(F62/2)*(F62/2)*PI()*$D$37/1000*0.7*($A$41+5)*30/360,IF(OR(C62=2,C62=3),B62*F62*$D$37/1000*0.7*($A$41+5)*30/360,0)),0))","v":0}]
["geplanter neuer Behälter",null,1,2,5,null,null,null,null,null,{"$f":"B63*IF(C63=1,(F63/2)*(F63/2)*PI()*N63,IF(C63=2,F63*N63,IF(C63=3,O63-P63,IF(C63=4,F63*N63,IF(E63=1,F63*(H63-0.1),F63*(H63-0.25))))))","v":0},{"$f":"B63*IF(C63=1,IF(E63=1,(F63/2)*(F63/2)*PI()*(H63),(F63/2)*(F63/2)*PI()*(H63)),IF(C63=2,IF(E63=1,F63*(H63),F63*(H63)),IF(C63=3,(F63+SQRT(F63*G63)+G63)*H63/3,IF(C63=4,F63*H63,IF(E63=1,F63*(H63),F63*(H63))))))","v":0},{"$f":"B63*IF(C63=1,(F63/2)*(F63/2)*PI()*N63+P63,IF(C63=2,F63*N63+P63,IF(C63=3,O63,IF(C63=4,F63*H63*0.8,F63*N63))))","v":0},{"$f":"IF(H63=0,0,IF(D63=2,H63-0.2-VLOOKUP(E63,S$51:T$55,2)-$D$37/1000*($A$41+5)*30/360*0.7,H63-VLOOKUP(D63,S$46:T$49,2)-VLOOKUP(E63,S$51:T$55,2)))","v":0},{"$f":"IF(C63=3,(F63+G63+SQRT(F63*G63))*H63/3-IF(E63=1,F63*0.2,F63*0.2+G63*0.15),0)","v":0},{"$f":"IF(OR(D63=1,D63=3,D63=4,H63=\"\"),0,IF(C63=1,(F63/2)*(F63/2)*PI()*$D$37/1000*0.7*($A$41+5)*30/360,IF(OR(C63=2,C63=3),F63*$D$37/1000*0.7*($A$41+5)*30/360,0)))","v":0},null,"Güllekeller",null,null,null,{"$f":"IF(B63=0,0,IF(D63=2,IF(C63=1,B63*(F63/2)*(F63/2)*PI()*$D$37/1000*0.7*($A$41+5)*30/360,IF(OR(C63=2,C63=3),B63*F63*$D$37/1000*0.7*($A$41+5)*30/360,0)),0))","v":0}]
[]
["* Bei der Nettolagerkapazität sind in Abhängigkeit der Schalterstellungen Freibord und Restfüllstand sowie 70% des anteiligen Jahresniederschlages bereits berücksichtigt."]
[]
["Die Lagerkapazität für Flüssigmist entspricht einer Lagerdauer von:",null,null,null,null,null,null,{"$f":"IF(J41+J42>0,(M63+M58)/((J41+J42+I58+J58+V58+V63)/(($A$41+5)*30)),\"\")","v":""},"Tagen=",{"$f":"IF(H67=\"\",\"\",H67/30)","v":""},"Monaten",null,null,null,null,{"$f":"IF(J41>0,(M63+M58)/((J41+I58+J58+P58+B63*P63)/(($A$41+5)*30)),\"\")","v":""},null,"überdacht","Rind"]
["Kommentar:",null,null,null,null,null,null,null,null,null,null,null,null,null,null,null,null,"offen"]
[null,null,null,null,null,null,null,null,null,null,null,null,null,null,null,null,null,"Stall","Schwein"]
["Anlage: Berechnung Flüssigmistlagerkapazität für den Gesamtbetrieb",null,null,null,null,null,null,null,null,null,{"$f":"Deckblatt!H3","v":"Version \"2017-2.8\""}]
["Betrieb:",{"$f":"B35","v":" "},null,null,null,null,"Untern.-Nr.:",null,{"$f":"I35","v":160000000000},null,{"$f":"K2","v":" "},null,null,null,null,null,null,null,"> Sperrfrist DüV (33 d)"]
["mitwirk. Unternehemen:",{"$f":"Deckblatt!E6","v":" "},null,null,null,null,"Bearbeiter:",null,{"$f":"Deckblatt!E8","v":" "},null,null,null,null,null,null,null,null,null,"2 Monate"]
["vorhandene Lagerkapazität",null,null,null,"Jahresniederschlag 30-jähriges Mittel (mm)",{"$f":"F4","v":1000},"Variante:",null,{"$f":"I37","v":" "},null,null,null,null,null,null,null,null,null,"3 Monate"]
["Name Lager","Anzahl","Behälter-","Art d.","Restfüllstand","Oberfläche","Grundfläche","Behälterh.","Abfüll-","einmünd.","Lagerraum","Volumen","Volumen","Behälterh.","Trapez-","Regenwasser",null,null,"4 Monate"]
[null,"Behält.","form","Abdeckung","Pumpensumpf","o. Durchm.","in m²","in m","fläche m²","Flächen m²","netto* in m³","gesamt","nutzbar","nutzb.","behölter",null,null,null,"5 Monate"]
[null,null,1,2,5,null,null,null,null,null,{"$f":"B76*IF(C76=1,(F76/2)*(F76/2)*PI()*N76-P76,IF(C76=2,F76*N76-P76,IF(C76=3,O76-P76,IF(C76=4,F76*N76,IF(E76=1,F76*(H76-0.1),F76*(H76-0.25))))))","v":0},{"$f":"B76*IF(C76=1,IF(E76=1,(F76/2)*(F76/2)*PI()*(H76),(F76/2)*(F76/2)*PI()*(H76)),IF(C76=2,IF(E76=1,F76*(H76),F76*(H76)),IF(C76=3,(F76+SQRT(F76*G76)+G76)*H76/3,IF(C76=4,F76*H76,IF(E76=1,F76*(H76),F76*(H76))))))","v":0},{"$f":"B76*IF(C76=1,(F76/2)*(F76/2)*PI()*(N76),IF(C76=2,F76*N76,IF(C76=3,O76,IF(C76=4,F76*N76,F76*N76))))","v":0},{"$f":"IF(H76=0,0,IF(C76=5,H76-0.1-VLOOKUP(E76,S$51:T$55,2),H76-VLOOKUP(D76,S$46:T$49,2)-VLOOKUP(E76,S$51:T$55,2)))","v":0},{"$f":"IF(C76=3,(F76+G76+SQRT(F76*G76))*H76/3-IF(E76=1,F76*0.2,F76*0.2+G76*0.15),0)","v":0},{"$f":"IF(OR(D76=1,D76=3,D76=4,H76=\"\"),0,IF(C76=1,(F76/2)*(F76/2)*PI()*$D$37/1000*0.7*($A$41+5)*30/360,IF(OR(C76=2,C76=3),F76*$D$37/1000*0.7*($A$41+5)*30/360,0)))","v":0},null,{"$f":"IF(B76=0,0,IF(D76=2,IF(C76=1,B76*(F76/2)*(F76/2)*PI()*$D$37/1000*0.7*($A$41+5)*30/360,IF(OR(C76=2,C76=3),B76*F76*$D$37/1000*0.7*($A$41+5)*30/360,0)),0))","v":0},"6 Monate"]
[null,null,1,2,5,null,null,null,null,null,0,{"$f":"B77*IF(C77=1,IF(E77=1,(F77/2)*(F77/2)*PI()*(H77),(F77/2)*(F77/2)*PI()*(H77)),IF(C77=2,IF(E77=1,F77*(H77),F77*(H77)),IF(C77=3,(F77+SQRT(F77*G77)+G77)*H77/3,IF(C77=4,F77*H77,IF(E77=1,F77*(H77),F77*(H77))))))","v":0},0,0,0,0,null,{"$f":"IF(B77=0,0,IF(D77=2,IF(C77=1,B77*(F77/2)*(F77/2)*PI()*$D$37/1000*0.7*($A$41+5)*30/360,IF(OR(C77=2,C77=3),B77*F77*$D$37/1000*0.7*($A$41+5)*30/360,0)),0))","v":0},"7 Monate"]
[null,null,1,2,5,null,null,null,null,null,0,0,0,0,0,0,null,0,"8 Monate"]
[null,null,1,2,5,null,null,null,null,null,0,0,0,0,0,0,null,0,"9 Monate"]
[null,null,1,2,5,null,null,null,null,null,0,0,0,0,0,0,null,0,"10 Monate"]
[null,null,1,2,5,null,null,null,null,null,0,0,0,0,0,0,null,0,"11 Monate"]
[null,null,1,2,5,null,null,null,null,null,0,0,0,0,0,0,null,0,"12 Monate"]
[null,null,1,2,5,null,null,null,null,null,0,0,0,0,0,0,null,0]
[null,null,1,2,5,null,null,null,null,null,0,0,0,0,0,0,null,0]
[null,null,1,2,5,null,null,null,null,null,0,0,0,0,0,0,null,0]
[null,null,1,2,5,null,null,null,null,null,0,0,0,0,0,0,null,0]
[null,null,1,2,5,null,null,null,null,null,0,0,0,0,0,0,null,0]
[null,null,1,2,5,null,null,null,null,null,0,0,0,0,0,0,null,0]
[null,null,1,2,5,null,null,null,null,null,0,0,0,0,0,0,null,0]
[null,null,1,2,5,null,null,null,null,null,0,0,0,0,0,0,null,0]
[null,null,1,2,5,null,null,null,null,null,0,0,0,0,0,0,null,0]
[null,null,1,2,5,null,null,null,null,null,0,0,0,0,0,0,null,0]
["Summe",{"$f":"SUM(B76:B92)","v":0},null,null,null,null,null,null,{"$f":"(SUM(I76:I92))*($F$4/1000*($A$41+5)*30/360*0.7)","v":0},{"$f":"(SUM(J76:J92))*($F$4/1000*($A$41+5)*30/360*0.7)","v":0},{"$f":"SUM(K76:K92)","v":0},{"$f":"SUM(L76:L92)","v":0},{"$f":"SUM(M76:M92)","v":0},null,null,{"$f":"SUM(P76:P92)","v":0},null,{"$f":"SUM(R76:R92)","v":0}]
[]
[]
[]
[]
[]
[]
[]
[]
[]
[]
[]
[]
[]
[]
[]
[]
[]
[]
[null,null,null,null,null,null,null,null,null,null,3]

{"sheet":"Lager_Gefl.","index":5,"n_rows":52,"n_cols":17,"rows_kept":52,"cut":false,"hidden":false,"merged":[[44,0,44,1],[45,0,45,1],[46,0,46,1],[1,7,1,8],[14,0,14,1],[16,0,16,1],[17,0,17,1],[15,0,15,1],[52,0,53,8],[3,0,5,1],[6,0,6,1],[7,0,7,1],[9,0,9,1],[10,0,10,1],[11,0,11,1],[18,0,18,1],[19,0,19,1],[24,0,24,1],[25,0,25,1],[12,0,12,1],[13,0,13,1],[47,0,47,1],[48,0,48,1],[49,0,49,1]]}
["Flüssig- und Festmistanfall für Geflügel u. Kaninchen",null,null,null,null,null,null,{"$f":"Deckblatt!H3","v":"Version \"2017-2.8\""},{"$f":"Deckblatt!O31","v":" "}]
["Betrieb:",null,{"$f":"Deckblatt!E15","v":" "},null,null,null,"Untern.-Nr.:",{"$f":"Deckblatt!E25","v":160000000000}]
["mitwirk. Unternehmen:",null,{"$f":"Deckblatt!E6","v":" "},null,null,null,"Bearbeiter:",{"$f":"Deckblatt!E8","v":" "}]
[null,null,"Tier-","Tierplätze","Tierplätze","Tierplätze","Anfall","Anfall","Anfall"]
[null,null,"plätze","Gülle","Trockenkot","Tiefstreu","Gülle/Jauche","Trockenkot","Festmist"]
[null,null,null,null,null,null,1,2,1]
["Legehennen ",null,null,null,null,null,null,{"$f":"E7*O16/1000*(H6+4)","v":0},{"$f":"F7*P16/1000*(I6+4)","v":0}]
["über 6 Monate",null,{"$f":"IF(D7+E7+F7=C7,\"\",D7+E7+F7-C7)","v":""}]
["Küken und Junghennen",null,null,null,null,null,null,{"$f":"E9*O17/1000*(H6+4)","v":0},{"$f":"F9*P17/1000*(I6+4)","v":0}]
["zur Aufzucht",null,{"$f":"IF(D9+E9+F9=C9,\"\",D9+E9+F9-C9)","v":""}]
["Masthähnchen (Broiler)",null,null,null,null,null,null,null,{"$f":"F11*P18/1000*(I6+4)","v":0}]
["Mast über 39 Tage",null,{"$f":"IF(D11+E11+F11=C11,\"\",D11+E11+F11-C11)","v":""},null,null,null,null,null,null,null,null,null,null,"Lagerbedarf","Lagerbedarf","Lagerbedarf"]
["Masthähnchen (Broiler)",null,null,null,null,null,null,null,{"$f":"F13*P19/1000*(I6+4)","v":0},null,null,"Frischmist","Frischmist","Gülle","Trockenkot","Tiefstreu","Jauche b. Tr-kot"]
["Mast über 34 Tage",null,{"$f":"IF(D13+E13+F13=C13,\"\",D13+E13+F13-C13)","v":""}]
["Masthähnchen (Broiler)",null,null,null,null,null,null,null,{"$f":"F15*P20/1000*(I6+4)","v":0},null,null,"t/Tier","m³/Tier","1000 Tiere"]
["Mast 30 bis 33 Tage",null,{"$f":"IF(D15+E15+F15=C15,\"\",D15+E15+F15-C15)","v":""},null,null,null,null,null,null," Legehennen über 6 Monate",3.2258059999999999E-3,1.833,2.2999999999999998,null,2.2000000000000002,2.5]
["Masthähnchen (Broiler)",null,null,null,null,null,null,null,{"$f":"F17*P21/1000*(I6+4)","v":0}," Küken und Junghennen zur Aufzucht als Legehennen",1.351351E-3,0.58299999999999996,0.7,null,0.8,0.9]
["Mast bis 29 Tage",null,{"$f":"IF(D17+E17+F17=C17,\"\",D17+E17+F17-C17)","v":""},null,null,null,null,null,null," Masthähnchen (Broiler), Mast über 39 d",null,0.98399999999999999,1.2,null,null,1.2]
[" Enten zur Zucht",null,null,null,null,null,null,null,{"$f":"F19*P22/1000*(I6+4)","v":0}," Masthähnchen (Broiler), Mast über 34 d",1.4492750000000001E-3,0.92500000000000004,1.2,null,null,1.2]
[null,null,{"$f":"IF(D19+E19+F19=C19,\"\",D19+E19+F19-C19)","v":""},null,null,null,null,null,null," Masthähnchen (Broiler), Mast 30-33 d",null,0.83299999999999996,1,null,null,1]
["Mastenten","Tage Stall",null,null,null,null,{"$f":"IF(B22>0,D21*N23/1000/30*B22,D21*N23/1000*(G6+5))","v":0},null,{"$f":"IF(B22>0,F21*P23/1000/30*B22,F21*P23/1000*(I6+4))","v":0}," Masthähnchen (Broiler), Mast bis 29 d",null,0.77500000000000002,1,null,null,1]
["Pekingenten",null,{"$f":"IF(D21+E21+F21=C21,\"\",D21+E21+F21-C21)","v":""},null,null,null,null,null,null," Enten (!zur Zucht!)",6.8965509999999999E-3,8.5,10.6,null,null,10.6]
["Mastenten","Tage Stall",null,null,null,null,null,null,{"$f":"IF(B24>0,F23*P24/1000/30*B24,F23*P24/1000*(I6+4))","v":0},"Mastenten, Pekingenten",2.857142E-3,4.8,6,6,null,6]
["Flugenten",null,{"$f":"IF(D23+E23+F23=C23,\"\",D23+E23+F23-C23)","v":""},null,null,null,null,null,null,"Mastenten, Flugenten",null,3.83,4.8,null,null,4.8]
["Gänse zur Zucht",null,null,null,null,null,null,null,{"$f":"F25*P25/1000*(I6+4)","v":0}," Gänse (! zur Zucht !)",1.5384615000000001E-2,9.5,11.9,null,null,11.9]
[null,null,{"$f":"IF(D25+E25+F25=C25,\"\",D25+E25+F25-C25)","v":""},null,null,null,null,null,null,"Mastgänse, Kurzmast bis 5,0 kg",null,1.383,1.7,null,null,1.3]
["Mastgänse","Tage Stall",null,null,null,null,null,null,{"$f":"IF(B28>0,F27*P26/1000/30*B28,F27*P26/1000*(I6+4))","v":0},"Mastgänse Mittelmast bis 6,8 kg",6.0606059999999996E-3,3.117,3.9,null,null,3]
["Kurzmast bis 5,0 kg",null,{"$f":"IF(D27+E27+F27=C27,\"\",D27+E27+F27-C27)","v":""},null,null,null,null,null,null,"Mastgänse Langmast bis 7,8 kg",null,5.133,6.4,null,null,4.8]
["Mastgänse","Tage Stall",null,null,null,null,null,null,{"$f":"IF(B30>0,F29*P27/1000/30*B30,F29*P27/1000*(I6+4))","v":0},"Mastputen, Hennen bis 17 Wochen",1.33333333E-2,4.2,8.4,null,null,6.3]
["Mittelmast bis 6,8 kg",null,{"$f":"IF(D29+E29+F29=C29,\"\",D29+E29+F29-C29)","v":""},null,null,null,null,null,null,"Mastputen Hähne bis 21 Wochen",null,4.0330000000000004,8.1,null,null,6]
["Mastgänse","Tage Stall",null,null,null,null,null,null,{"$f":"IF(B32>0,F31*P28/1000/30*B32,F31*P28/1000*(I6+4))","v":0},"Mastputen, Hennen ab 6. Woche",null,5,10,null,null,7.5]
["Langmast bis 7,8 kg",null,{"$f":"IF(D31+E31+F31=C31,\"\",D31+E31+F31-C31)","v":""},null,null,null,null,null,null,"Mastputen Hähne ab 6. Woche",null,5.0839999999999996,10.199999999999999,null,null,7.6]
["Mastputen","Tage Stall",null,null,null,null,null,null,{"$f":"IF(B34>0,F33*P29/1000/30*B34,F33*P29/1000*(I6+4))","v":0},"Mastputen, gemischtgeschl. Mast, incl. Aufzucht",null,4.12,8.1999999999999993,null,null,6.2]
["Hennen bis 17 Wochen",null,{"$f":"IF(D33+E33+F33=C33,\"\",D33+E33+F33-C33)","v":""},null,null,null,null,null,null,"Putenaufzucht bis 5 Wochen",null,1.1000000000000001,2.2000000000000002,null,null,2.2000000000000002]
["Mastputen","Tage Stall",null,null,null,null,null,null,{"$f":"IF(B36>0,F35*P30/1000/30*B36,F35*P30/1000*(I6+4))","v":0}," Kaninchen (! Zucht-  und Mast geschl. System, je Häsin!)",2.5000000000000001E-2,101.3,109.6,74.599999999999994,33.9,82.2,47.5]
["Hähne bis 21 Wochen",null,{"$f":"IF(D35+E35+F35=C35,\"\",D35+E35+F35-C35)","v":""},null,null,null,null,null,null,"Mastkaninchen",2.0999999999999999E-3,9.3800000000000008,10.4,6.88,3.1,9,4.4000000000000004]
["Mastputen","Tage Stall",null,null,null,null,null,null,{"$f":"IF(B38>0,F37*P31/1000/30*B38,F37*P31/1000*(I6+4))","v":0},"Zuchtkaninchen mit Absetzer",1.3299999999999999E-2,23.25,25.8,17,7.7,21,10.8]
["Hennen ab 6. Woche",null,{"$f":"IF(D37+E37+F37=C37,\"\",D37+E37+F37-C37)","v":""},null,null,null,null,null,null,null,null,null,null,null,"800kg/m³"]
["Mastputen","Tage Stall",null,null,null,null,null,null,{"$f":"IF(B40>0,F39*P32/1000/30*B40,F39*P32/1000*(I6+4))","v":0}]
["Hähne ab 6. Woche",null,{"$f":"IF(D39+E39+F39=C39,\"\",D39+E39+F39-C39)","v":""},null,null,null,null,null,null,null,null,null,null,"33 Tage"]
["Mastputen","Tage Stall",null,null,null,null,null,null,{"$f":"IF(B42>0,F41*P33/1000/30*B42,F41*P33/1000*(I6+4))","v":0},null,null,null,null,"2 Monate"]
["gem.-geschl. Aufzucht u. Mast",null,{"$f":"IF(D41+E41+F41=C41,\"\",D41+E41+F41-C41)","v":""},null,null,null,null,null,null,null,null,null,null,"3 Monate"]
["Putenaufzucht bis 5 Wochen",null,null,null,null,null,null,null,{"$f":"F43*P34/1000*(I6+4)","v":0},null,null,null,null,"4 Monate"]
[null,null,{"$f":"IF(D43+E43+F43=C43,\"\",D43+E43+F43-C43)","v":""},null,null,null,null,null,null,null,null,null,null,"5 Monate"]
["Zuchtkaninchen ",null,null,null,null,null,{"$f":"D45*N37/1000*(G6+5)","v":0},{"$f":"E45*O35/1000*(H6+4)","v":0},{"$f":"F45*P35/1000*(I6+4)","v":0},null,null,null,null,"6 Monate"]
["mit Absetzern",null,{"$f":"IF(D45+E45+F45=C45,\"\",D45+E45+F45-C45)","v":""},null,null,null,{"$f":"E45*Q37/1000*(G6+5)","v":0},null,null,null,null,null,null,"7 Monate"]
["Mastkaninchen",null,null,null,null,null,{"$f":"D47*N36/1000*(G6+5)","v":0},{"$f":"E47*O36/1000*(H6+4)","v":0},{"$f":"F47*P36/1000*(I6+3)","v":0},null,null,null,null,"8 Monate"]
[null,null,{"$f":"IF(D47+E47+F47=C47,\"\",D47+E47+F47-C47)","v":""},null,null,null,{"$f":"E47*Q36/1000*(G6+5)","v":0},null,null,null,null,null,null,"9 Monate"]
["Kaninchen, einschl. Nachzucht",null,null,null,null,null,{"$f":"D49*N35/1000*(G6+5)","v":0},{"$f":"E49*O37/1000*(H6+4)","v":0},{"$f":"F49*P37/1000*(I6+3)","v":0},null,null,null,null,"10 Monate"]
["geschlossenes System",null,{"$f":"IF(D49+E49+F49=C49,\"\",D49+E49+F49-C49)","v":""},null,null,null,{"$f":"E49*Q35/1000*(G6+5)","v":0},null,null,null,null,null,null,"11 Monate"]
["Summe",null,{"$f":"C7+C9+C11+C13+C15+C17+C19+C21+C23+C25+C27+C29+C31+C33+C35+C37+C39+C41+C43+C45+C47+C49","v":0},null,null,null,{"$f":"SUM(G7:G50)","v":0},{"$f":"H49+H47+H45+H7+H9","v":0},{"$f":"SUM(I7:I49)","v":0},null,null,null,null,"12 Monate"]
["Kommentar:"]

{"sheet":"Lager_Schaf","index":6,"n_rows":37,"n_cols":14,"rows_kept":37,"cut":false,"hidden":false,"merged":[[33,0,44,6],[1,5,1,6]]}
["Flüssig- und Festmistanfall für Schafe und Pferde",null,null,null,null,{"$f":"Deckblatt!H3","v":"Version \"2017-2.8\""},{"$f":"Deckblatt!O31","v":" "}]
["Betrieb:",{"$f":"Deckblatt!E15","v":" "},null,null,"Untern.-Nr.:",{"$f":"Deckblatt!E25","v":160000000000}]
["mitwirk. Unternehmen:",{"$f":"Deckblatt!E6","v":" "},null,null,"Bearbeiter:",{"$f":"Deckblatt!E8","v":" "}]
[null,null,"Flachstreu","Tiefstreu","Anfall in m³","Anfall in m³",null,null,null,null,"Frischmist",null,"Tiefstreu"]
[null,"Tierplätze","(Frischmist)",null,"Festmist","Reinig.-wasser",null,null,null,"GV","t/Tier","m³/Tier","m³/Tier"]
[null,"gesamt","Tierplätze","Tierplätze",{"$f":"Betrieb!A6","v":1},1,null,null," Schafe unter 1 Jahr  und Hammel",0.1,7.3999999999999996E-2,0.114,0.08]
["Mutterschafe",null,null,null,{"$f":"(C7*L7*VLOOKUP(E6,K26:L31,2)+IF(E6<3,D7*L7,D7*M7))*IF(E$6=1,E$6*1.1,E$6)","v":0},null,null,null," Mutterschafe",0.15,9.1999999999999998E-2,0.14199999999999999,0.1]
["Melkhausabwasser in Jauche einleiten ?",null,null,null,1,{"$f":"IF(E8=1,N12*(F6+5)*(C7+D7),0)","v":0}]
["weibl. Schafe > 1Jahr",null,null,null,{"$f":"(C9*L10*VLOOKUP(E6,K26:L31,2)+IF(E6<3,D9*L10,D9*M10))*IF(E$6=1,E$6*1.1,E$6)","v":0},null,null,null,"Mastlämmer",0.06,4.5999999999999999E-2,7.0999999999999994E-2,0.05]
["(Zutreter)",null,null,null,null,null,null,null," Weibliche Schafe über 1 Jahr  (Zutreter)",0.15,8.3000000000000004E-2,0.128,0.09]
["Schafe < 1 Jahr",null,null,null,{"$f":"(C11*L6*VLOOKUP(E6,K26:L31,2)+IF(E6<3,D11*L6,D11*M6))*IF(E$6=1,E$6*1.1,E$6)","v":0},null,null,null," Andere Schafe über 1 Jahr (Böcke)",0.2,0.11,0.16900000000000001,0.12]
["und Hammel",null,null,null,null,null,null,null," Mutterziegen",0.15,8.3000000000000004E-2,0.128,0.09,4.4999999999999998E-2]
["and. Schafe >1 Jahr",null,null,null,{"$f":"(C13*L11*VLOOKUP(E6,K26:L31,2)+IF(E6<3,D13*L11,D13*M11))*IF(E$6=1,E$6*1.1,E$6)","v":0},null,null,null," andere Ziegen (unter 1 Jahr)",0.15,5.5E-2,8.5000000000000006E-2,0.06]
["(Böcke)"]
["Mastlämmer",null,null,null,{"$f":"(C15*L9*VLOOKUP(E6,K26:L31,2)+IF(E6<3,D15*L9,D15*M9))*IF(E$6=1,E$6*1.1,E$6)","v":0},null,null,null," Pferde unter 6 Monate, Ponys, Kleinpferde",0.5,0.28299999999999997,0.47,0.35]
[null,null,null,null,null,null,null,null,"Pferde 6 Monate- 3Jahre",0.75,0.56599999999999995,0.94,0.7]
["Summe Schafe",null,null,null,{"$f":"E7+E9+E11+E13+E15","v":0}]
[]
["Mutterziegen",null,null,null,{"$f":"(C19*L12*VLOOKUP(E6,K26:L31,2)+IF(E6<3,D19*L12,D19*M12))*IF(E$6=1,E$6*1.1,E$6)","v":0},null,null,null," Pferde über 3 Jahre ",1.1000000000000001,0.93300000000000005,1.6,1.1000000000000001]
["Melkhausabwasser in Jauche einleiten ?",null,null,null,1,{"$f":"IF(E20=1,N12*(F6+5)*(C19+D19),0)","v":0},null,null,null,"ja"]
["andere Ziegen",null,null,null,{"$f":"(C21*L13*VLOOKUP(E6,K26:L31,2)+IF(E6<3,D21*L13,D21*M13))*IF(E$6=1,E$6*1.1,E$6)","v":0},null,null,null,null,"nein"]
["(unter 1 Jahr)"]
["Summe Ziegen",null,null,null,{"$f":"E19+E21","v":0}]
[]
["Pferde ",null,null,null,{"$f":"(C25*L19*VLOOKUP(E6,K26:L31,2)+IF(E6<3,D25*L19,D25*M19))*IF(E$6=1,E$6*1.1,E$6)","v":0}]
["über 3 Jahre",null,null,null,null,null,null,null,null,"33 Tage",1,1]
["Pferde 6 Mo.-3 Jahre",null,null,null,{"$f":"(C27*L16*VLOOKUP(E6,K26:L31,2)+IF(E6<3,D27*L16,D27*M16))*IF(E$6=1,E$6*1.1,E$6)","v":0},null,null,null,null,"2 Monate",2,1]
["Kleinpferde",null,null,null,null,null,null,null,null,"3 Monate",3,0.86599999999999999]
["Pferde unter 6 Mon.",null,null,null,{"$f":"(C29*L15*VLOOKUP(E6,K26:L31,2)+IF(E6<3,D29*L15,D29*M15))*IF(E$6=1,E$6*1.1,E$6)","v":0},null,null,null,null,"4 Monate",4,0.8]
["Ponys, Esel",null,null,null,null,null,null,null,null,"5 Monate",5,0.76]
["Summe Pferde",null,null,null,{"$f":"E29+E27+E25","v":0},null,null,null,null,"6 Monate",6,0.73]
["Summe ",{"$f":"B29+B27+B25+B21+B19+B15+B13+B11+B9+B7","v":0},null,null,{"$f":"E31+E23+E17","v":0},{"$f":"SUM(F7:F30)","v":0},null,null,null,"7 Monate"]
["Kommentar:",null,null,null,null,null,null,null,null,"8 Monate"]
[null,null,null,null,null,null,null,null,null,"9 Monate"]
[null,null,null,null,null,null,null,null,null,"10 Monate"]
[null,null,null,null,null,null,null,null,null,"11 Monate"]
[null,null,null,null,null,null,null,null,null,"12 Monate"]

{"sheet":"Hilfe","index":7,"n_rows":62,"n_cols":3,"rows_kept":62,"cut":false,"hidden":false,"merged":[[2,0,2,2],[3,0,3,2],[1,0,1,1]]}
["Hinweise und Erläuterungen zur Programmbenutzung"]
["Erklärung:"]
["Das EXCEL-Programm zur Ermittlung der Lagerkapazität von Dung wurde mit großer Sorgfalt erstellt. Trotzdem können Fehler bei der Programmierung nicht ausgeschlossen werden. Das Landesamt für Umwelt, Landwirtschaft und Geologie (LfULG)  bzw. die Thüringer Landesanstalt für Landwirtschaft (TLL) übernehmen keinerlei Haftung für Schäden und Nachteile, die aus Programmfehlern, fehlerhaft hinterlegten Daten, fehlerhafter Programmanwendung oder Programmdokumentation einschließlich unzureichender, fehlerhafter oder missverständlicher Anwendungshinweise, fehlender Programmaktualisierung etc. resultieren. Weiterhin weisen wir darauf hin, dass das Programm nur als Hilfsmittel zur Vereinfachung der Verwaltungsverfahren, nicht aber als offizielles Dokument oder Instrument zur Verfügung gestellt wird. Wir garantieren nicht, dass immer die aktuellste Version des Programms zur Verfügung gestellt wird."]
["Sächsisches Landesamt für Umwelt, Landwirtschaft und Geologie (LfULG) 2008 / 2017 / 2018"]
[]
["Zweck",null,"Das Programm \"Lagerka\" dient zur Ermittlung und zum Nachweis der Lagerkapazit für Wirtschaftsdünger bei der Förderung landwirtschaftlicher Unternehmen, bei Genehmigungsverfahren sowie Kontrollen im Rahmen von Cross-Complience"]
[]
["Exceleinstellungen"]
["Makrosicherheit: ",null,"ab Excel 2007: Datei/Optionen/Sicherheitscenter/Einstellungen für das Sicherheitscenter/Einstellungen für Makros --> \"Alle Makros mit Benachrichtigung deaktivieren\""]
[]
["Aufbau",null,"Das Programm ist im Seitenmodus aufgebaut. Sind mehrere Tabellen auf einem Arbeitsblatt, entspricht jede Tabelle einer Seite"]
[]
["Tabellen"]
["Deckblatt:",null,"Angaben zum Betrieb und zum Bearbeiter"]
["Lager_Ri:",null,"Dunganfall für Rinder, Silosickersaftanfall"]
["Lager_Schwein:",null,"Dunganfall für Schweine"]
["Lager_Schaf:",null,"Dunganfall für Schafe, Ziegen und Pferde"]
["Lager_Gefl.:",null,"Dunganfall für Geflügel und Kaninchen"]
["Coferm:",null,"Anfallsberechnung von Biogasfugat aus Kofermenten, Berechnung von Phasenanteilen bei der Gärrest- bzw. Gülleseparation"]
["Betrieb: ",null,"Zusammenfassung der Wirtschaftsdüngeranfallswerte aus den Lager_*-Tabellen und der Tabelle Cofermente, Berechnung der Lagerkapazität und der Lagerdauer, Berücksichtigung von Freibord, Niederschlägen und ggf. Restfüllstand"]
["Ergebnis:",null,"Nachweis der vorhandenen Lagerkapazität für Behörden, z.B. im Rahmen von CC-Kontrollen"]
["JNS-TH:",null,"Hilfstabelle zur Ermittlung des Jahresniederschlages für die Gemeinden in Thüringen. Die Niederschläge sind das 30-jährige Mittel von 1981-2010. Weitere/aktuellere Jahresniederschläge für ausgewählte Wetterstationen in Deutschland können beim DWD abgerufen werden."]
["WD-Anfall:",null,"Die Tabelle enthält die monatlichen Anfallsmengen"]
["TIPLA_Mi, TIPLA_S:",null,"Die Tabellen Tierplatzplanung Milch (TIPLA_Mi) und Tierplatzplanung Schwein (TIPLA_S) dienen auschließlich Planungszwecken"]
["Mako-Tabellen:",null,"Hilfstabellen zur Makrosteuerung"]
[]
["Bedienungshinweise"]
["Deckblatt:",null,"Im Deckblatt müssen mindestens die Zeilen: Betrieb, Datum, Jahresniederschlag, Bearbeiter und Unternehmensnummer ausgefüllt werden. Diese Daten werden automatisch in die weiteren Tabellen übernommen."]
[]
["Kommentare:",null,"Zur Hilfestellung und Erläuterung befinden sich an einigen Zellen rechts oben rote Ecken. Beim Überstreichen der Zelle mit dem Cursors werden die Kommentare sichtbar."]
[]
["Pull-Down-Schalter:",null,"Die Schalter gestatten eine Optionsauswahl. Achten Sie insbesondere bei den Schaltern zur Lagerdauer auf richtige Einstellungen."]
[]
["Übernahme-Schalter:",null,"Diese Schalter übernehmen Zahlenwerte aus anderen Tabellen"]
[]
["Sprungschalter:",null,"Mit den Sprungschaltern ist der Sprung in ein anderes Tabellenblatt möglich. Sie ergänzen das Karteisystem unterhalb des Excel-Arbeitsblattes"]
[]
["Löschschalter:",null,"Die Schalter ermöglichen die Löschung der Eingaben innerhalb einer Tabelle. \nAchtung!!!: Löschungen per Makro sind nicht rückgängig zu machen!"]
[]
["Bedeutung der Zellfarben:",null,"Hellblaue Zellen sind Eingabezellen, nur in diese Zellen kann geschrieben werden."]
[null,null,"Gelbe Zellen sind (Zwischen-)Ergebniszellen - gesperrt"]
[null,null,"Hellbraune Zellen sind  Ergebnisszellen - gesperrt"]
[null,null,"Alle anderen Farben dienen optischen Abgrenzungen - gesperrt"]
[]
["weitere Hinweise",null,"In der Tabelle \"Betrieb\" besteht die Möglichkeit die Anfallsmengen von Dung, Silosickersaft und Fugat aus Kofermenten mittels Schalter zu übernehmen. Gleichzeitig können die Anfallsmengen aber auch direkt eingetragen werden. Bitte berücksichtigen Sie dabei den eingestellten Lagerzeitraum (Schalterstellung)! Dies gilt auch für entsprechende Eingaben zum Minder- bzw. Mehranfall."]
[]
[null,null,"Nach Düngeverordnung darf Festmist von Huf- und Klauentieren vom 15. Dezember bis einschließlich 15. Januar nicht ausgebracht werden. Daraus resultiert eine Mindestlagerdauer von 33 Tagen für Festmist von Huf-und Klauentieren. "]
[]
[null,null,"In der Tabelle \"Betrieb - Festmistanfall\" sind neue Schalter für die Zuordnung von einzelnen Tierarten auf bestimmte Lagerstätten - hier speziell die Lagerstätte \"Stall\" bei Tiefstreuverfahren - angeordnet worden. Dies soll  ausschließen, dass Ställe mit einer Lagerkapazität über 33 Tagen - bzw. 2 Monaten ab 2020 rechnerisch zum Lager für Festmiste anderer Tiergruppen werden."]
[]
[null,null,"Da die verkürzte Ausbringesperrfrist nur für Festmiste von Huf- und Klauentieren gilt, ergeben sich für andere Formen von Festmist auch andere Lagerkapazitäten:\n- für Geflügeltrockenkot und Geflügelmist mindestens 5 Monate\n- für Feststoffe von Gülle und Gärresten mindestens 6 Monate."]
[]
[null,null,"In den Tabellen \"Rind\", \"Geflügel\" und \"Schaf\" kann für einige Tiergruppen die Stallhaltungsdauer in Tagen angegeben werden. Ist die Dauer kürzer als die Schalterstellung 6 ...12 Monate, wird der Flüssigmistanfall auf die angegebene Tageszahl reduziert. Nach Düngeverordnung 2017 betrifft dies den Zeitraum vom 01.Oktober bis 01.April. Diese Angaben sind entsprechend gesondert zu begründen. \nDa die Düngeverordnung 2017 für Festmist von Huf-und Klauentieren nur noch eine Lagerkapazität von mehr als 32 Tagen (2 Monate ab 2020) vorsieht, hat die Stallhaltungsdauer auf den Festmistanfall hier keinen Einfluss."]
[]
["Ansprechpartner:",null,"Informationen zur Programmnutzung erteilen die zuständigen Landwirtschaftsämter als Kontrollbehörde."]
[]
[null,null,"Weitergehende Fragen zu Programm und Daten können über die Thüringer Landesanstalt für Landwirtschaft geklärt werden: Dr. W. Zorn, +49 361 574041-417,  H. Heß +49 361 574041-312 und E. Ullmann +49 361 574041-141."]
[null,null,"wilfried.zorn@tll.thueringen.de"]
[null,null,"hubert.hess@tll.thueringen.de"]
[null,null,"eric.ullmann@tll.thueringen.de"]
[null,null,"Für programminterne Fragen kann Herr Thomas Heidenreich (Sächsisches Landesamt für Umwelt, Landwirtschaft und Geologie; LfULG) als Programmentwickler Auskunft geben (Tel.Nr: 034222 46-2205)."]
["Link zu LAGERKA:",null,"www.thueringen.de/th9/tll/publikationen/software"]

{"sheet":"JNS-Th","index":8,"n_rows":862,"n_cols":4,"rows_kept":862,"cut":false,"hidden":false,"merged":[[0,0,0,2]]}
["Mittelwerte Jahresniederschlag für den Zeitraum 1981-2010                                                    Quelle:DWD Hr. F. Böttcher; 23.03.2018"]
["Kreis","Gemeinde","Mittlerer Jahresniederschlag"]
["Altenburger-Land","Altenburg",613]
["Altenburger-Land","Altkirchen",613]
["Altenburger-Land","Dobitschen",613]
["Altenburger-Land","Drogen",613]
["Altenburger-Land","Ehrenberg",613]
["Altenburger-Land","Fockendorf",613]
["Altenburger-Land","Frohnsdorf",613]
["Altenburger-Land","Gerstenberg",613]
["Altenburger-Land","Göhren",613]
["Altenburger-Land","Göllnitz",613]
["Altenburger-Land","Göpfersdorf",613]
["Altenburger-Land","Gößnitz",630]
["Altenburger-Land","Großröda",613]
["Altenburger-Land","Heukewalde",613]
["Altenburger-Land","Heyersdorf",613]
["Altenburger-Land","Jonaswalde",613]
["Altenburger-Land","Jückelberg",683]
["Altenburger-Land","Kriebitzsch",613]
["Altenburger-Land","Langenleuba-Niederhain",613]
["Altenburger-Land","Löbichau",613]
["Altenburger-Land","Lödla",613]
["Altenburger-Land","Lucka",613]
["Altenburger-Land","Lumpzig",619]
["Altenburger-Land","Mehna",613]
["Altenburger-Land","Meuselwitz",614]
["Altenburger-Land","Monstab",613]
["Altenburger-Land","Nöbdenitz",613]
["Altenburger-Land","Nobitz",613]
["Altenburger-Land","Ponitz",636]
["Altenburger-Land","Posterstein",666]
["Altenburger-Land","Rositz",613]
["Altenburger-Land","Schmölln",613]
["Altenburger-Land","Starkenberg",613]
["Altenburger-Land","Thonhausen",613]
["Altenburger-Land","Treben",613]
["Altenburger-Land","Vollmershain",613]
["Altenburger-Land","Wildenbörten",613]
["Altenburger-Land","Windischleuba",579]
["Altenburger-Land","Ziegelheim",613]
["Eichsfeld","Am Ohmberg",727]
["Eichsfeld","Arenshausen",727]
["Eichsfeld","Asbach-Sickenberg",727]
["Eichsfeld","Berlingerode",719]
["Eichsfeld","Bernterode (bei Heilbad Heiligenstadt)",727]
["Eichsfeld","Birkenfelde",727]
["Eichsfeld","Bockelnhagen",727]
["Eichsfeld","Bodenrode-Westhausen",727]
["Eichsfeld","Bornhagen",723]
["Eichsfeld","Brehme",727]
["Eichsfeld","Breitenworbis",727]
["Eichsfeld","Buhla",727,"x"]
["Eichsfeld","Burgwalde",727]
["Eichsfeld","Büttstedt",727]
["Eichsfeld","Deuna",727]
["Eichsfeld","Dieterode",727]
["Eichsfeld","Dietzenrode/Vatterode",727]
["Eichsfeld","Dingelstädt",752]
["Eichsfeld","Ecklingerode",727]
["Eichsfeld","Effelder",1060]
["Eichsfeld","Eichstruth",727]
["Eichsfeld","Ferna",727]
["Eichsfeld","Freienhagen",727]
["Eichsfeld","Fretterode",727]
["Eichsfeld","Geisleden",727]
["Eichsfeld","Geismar",727]
["Eichsfeld","Gerbershausen",727]
["Eichsfeld","Gernrode",727]
["Eichsfeld","Gerterode",727]
["Eichsfeld","Glasehausen",727]
["Eichsfeld","Großbartloff",727]
["Eichsfeld","Hausen",727]
["Eichsfeld","Haynrode",727]
["Eichsfeld","Heilbad Heiligenstadt",831]
["Eichsfeld","Helmsdorf",581]
["Eichsfeld","Heuthen",727]
["Eichsfeld","Hohengandern",727]
["Eichsfeld","Hohes Kreuz",768]
["Eichsfeld","Hundeshagen",727]
["Eichsfeld","Kallmerode",727]
["Eichsfeld","Kefferhausen",727]
["Eichsfeld","Kella",727]
["Eichsfeld","Kirchgandern",727]
["Eichsfeld","Kirchworbis",727]
["Eichsfeld","Kleinbartloff",727]
["Eichsfeld","Kreuzebra",727]
["Eichsfeld","Krombach",727]
["Eichsfeld","Küllstedt",727]
["Eichsfeld","Leinefelde-Worbis",727]
["Eichsfeld","Lenterode",727]
["Eichsfeld","Lindewerra",727]
["Eichsfeld","Lutter",727]
["Eichsfeld","Mackenrode",727]
["Eichsfeld","Marth",727]
["Eichsfeld","Niederorschel",727]
["Eichsfeld","Pfaffschwende",727]
["Eichsfeld","Reinholterode",703]
["Eichsfeld","Rohrberg",727]
["Eichsfeld","Röhrig",727]
["Eichsfeld","Rustenfelde",727]
["Eichsfeld","Schachtebich",727]
["Eichsfeld","Schimberg",727]
["Eichsfeld","Schönhagen",727]
["Eichsfeld","Schwobfeld",727,"x"]
["Eichsfeld","Sickerode",727]
["Eichsfeld","Silberhausen",727]
["Eichsfeld","Sonnenstein",727]
["Eichsfeld","Steinbach (EIC)",727]
["Eichsfeld","Steinheuterode",727]
["Eichsfeld","Steinrode",727]
["Eichsfeld","Tastungen",727]
["Eichsfeld","Teistungen",727]
["Eichsfeld","Thalwenden",727]
["Eichsfeld","Uder",716]
["Eichsfeld","Volkerode",727]
["Eichsfeld","Wachstedt",896]
["Eichsfeld","Wahlhausen",727]
["Eichsfeld","Wehnde",727]
["Eichsfeld","Wiesenfeld",727]
["Eichsfeld","Wingerode",727]
["Eichsfeld","Wüstheuterode",727]
["Eichsfeld","Zwinge",767]
["Gotha","Ballstädt",805]
["Gotha","Bienstädt",805]
["Gotha","Brüheim",805]
["Gotha","Bufleben",805]
["Gotha","Crawinkel",825]
["Gotha","Dachwig",534]
["Gotha","Döllstädt",805]
["Gotha","Drei Gleichen",587]
["Gotha","Emleben",805]
["Gotha","Eschenbergen",805]
["Gotha","Friedrichroda",805]
["Gotha","Friedrichswerth",805]
["Gotha","Friemar",593]
["Gotha","Georgenthal/Thür. Wald",805]
["Gotha","Gierstädt",534]
["Gotha","Goldbach",805]
["Gotha","Gotha",593]
["Gotha","Gräfenhain",805]
["Gotha","Großfahner",547]
["Gotha","Günthersleben-Wechmar",805]
["Gotha","Haina (GTH)",689]
["Gotha","Herrenhof",805]
["Gotha","Hochheim",805]
["Gotha","Hohenkirchen",805]
["Gotha","Hörsel",805]
["Gotha","Leinatal",805]
["Gotha","Luisenthal",1009]
["Gotha","Molschleben",547]
["Gotha","Nesse-Apfelstädt",547]
["Gotha","Nottleben",547]
["Gotha","Ohrdruf",805]
["Gotha","Petriroda",805]
["Gotha","Pferdingsleben",805,"x"]
["Gotha","Remstädt",805]
["Gotha","Schwabhausen",805]
["Gotha","Sonneborn",805]
["Gotha","Tabarz/Thür. Wald",805]
["Gotha","Tambach-Dietharz/Thür. Wald",983]
["Gotha","Tonna",538]
["Gotha","Tröchtelborn",805]
["Gotha","Tüttleben",547]
["Gotha","Waltershausen",805]
["Gotha","Wangenheim",805]
["Gotha","Warza",805]
["Gotha","Westhausen (GTH)",805]
["Gotha","Wölfis",805]
["Gotha","Zimmernsupra",547]
["Greiz","Auma-Weidatal",685]
["Greiz","Bad Köstritz",609]
["Greiz","Berga/Elster",685]
["Greiz","Bethenhausen",619]
["Greiz","Bocka",619]
["Greiz","Brahmenau",619]
["Greiz","Braunichswalde",641]
["Greiz","Caaschwitz",619]
["Greiz","Crimla",619]
["Greiz","Endschütz",619]
["Greiz","Gauern",619]
["Greiz","Greiz",640]
["Greiz","Großenstein",619]
["Greiz","Harth-Pöllnitz",659]
["Greiz","Hartmannsdorf (GRZ)",619]
["Greiz","Hilbersdorf",619]
["Greiz","Hirschfeld",619]
["Greiz","Hohenleuben",685]
["Greiz","Hundhaupten",619]
["Greiz","Kauern",619]
["Greiz","Korbußen",619]
["Greiz","Kraftsdorf",619]
["Greiz","Kühdorf",619]
["Greiz","Langenwetzendorf",685]
["Greiz","Langenwolschendorf",685]
["Greiz","Lederhose",732]
["Greiz","Linda b. Weida",662]
["Greiz","Lindenkreuz",662]
["Greiz","Mohlsdorf-Teichwolframsdorf",681]
["Greiz","Münchenbernsdorf",662]
["Greiz","Neumühle/Elster",685]
["Greiz","Paitzdorf",619]
["Greiz","Pölzig",619]
["Greiz","Reichstädt",662]
["Greiz","Ronneburg",619]
["Greiz","Rückersdorf",619]
["Greiz","Saara (GRZ)",619]
["Greiz","Schwaara",619]
["Greiz","Schwarzbach",619]
["Greiz","Seelingstädt",619]
["Greiz","Teichwitz",619]
["Greiz","Weida",685]
["Greiz","Weißendorf",685]
["Greiz","Wünschendorf/Elster",619]
["Greiz","Zedlitz",619]
["Greiz","Zeulenroda-Triebes",621]
["Hildburghausen","Ahlstädt",822]
["Hildburghausen","Auengrund",822]
["Hildburghausen","Bad Colberg-Heldburg",822]
["Hildburghausen","Beinerstadt",773]
["Hildburghausen","Bischofrod",822]
["Hildburghausen","Brünn/Thür.",822]
["Hildburghausen","Dingsleben",822]
["Hildburghausen","Eichenberg (HBN)",822]
["Hildburghausen","Eisfeld",822]
["Hildburghausen","Gompertshausen",822]
["Hildburghausen","Grimmelshausen",822]
["Hildburghausen","Grub",822]
["Hildburghausen","Hellingen",656]
["Hildburghausen","Henfstädt",822]
["Hildburghausen","Hildburghausen",822]
["Hildburghausen","Kloster Veßra",822]
["Hildburghausen","Lengfeld",822]
["Hildburghausen","Marisfeld",822]
["Hildburghausen","Masserberg",1245]
["Hildburghausen","Nahetal-Waldau",822]
["Hildburghausen","Oberstadt",822]
["Hildburghausen","Reurieth",822]
["Hildburghausen","Römhild",652]
["Hildburghausen","Sachsenbrunn",822]
["Hildburghausen","Schlechtsart",822]
["Hildburghausen","Schleusegrund",1114]
["Hildburghausen","Schleusingen",824]
["Hildburghausen","Schmeheim",822]
["Hildburghausen","Schweickershausen",822]
["Hildburghausen","St.Bernhard",773]
["Hildburghausen","St.Kilian",994]
["Hildburghausen","Straufhain",692]
["Hildburghausen","Themar",786]
["Hildburghausen","Ummerstadt",822]
["Hildburghausen","Veilsdorf",822]
["Hildburghausen","Westhausen (HBN)",822]
["Ilm-Kreis","Alkersleben",547]
["Ilm-Kreis","Altenfeld",547]
["Ilm-Kreis","Amt Wachsenburg",547]
["Ilm-Kreis","Angelroda",547]
["Ilm-Kreis","Arnstadt",624]
["Ilm-Kreis","Böhlen",547,"x"]
["Ilm-Kreis","Bösleben-Wüllersleben",575]
["Ilm-Kreis","Dornheim",547]
["Ilm-Kreis","Elgersburg",547]
["Ilm-Kreis","Elleben",547]
["Ilm-Kreis","Elxleben (IK)",547]
["Ilm-Kreis","Frankenhain",1070]
["Ilm-Kreis","Frauenwald",1176]
["Ilm-Kreis","Friedersdorf",742]
["Ilm-Kreis","Gehlberg",1258]
["Ilm-Kreis","Gehren",919]
["Ilm-Kreis","Geraberg",742]
["Ilm-Kreis","Geschwenda",742]
["Ilm-Kreis","Gillersdorf",742]
["Ilm-Kreis","Gossel",742]
["Ilm-Kreis","Gräfenroda",846]
["Ilm-Kreis","Großbreitenbach",1079]
["Ilm-Kreis","Herschdorf",742]
["Ilm-Kreis","Ilmenau",742]
["Ilm-Kreis","Ilmtal",591]
["Ilm-Kreis","Kirchheim",547]
["Ilm-Kreis","Langewiesen",742]
["Ilm-Kreis","Liebenstein",742]
["Ilm-Kreis","Martinroda (IK)",742]
["Ilm-Kreis","Neusiß",742]
["Ilm-Kreis","Neustadt am Rennsteig",742]
["Ilm-Kreis","Osthausen-Wülfershausen",547]
["Ilm-Kreis","Pennewitz",742]
["Ilm-Kreis","Plaue",742]
["Ilm-Kreis","Rockhausen",547]
["Ilm-Kreis","Schmiedefeld am Rennsteig",921]
["Ilm-Kreis","Stadtilm",742]
["Ilm-Kreis","Stützerbach",742]
["Ilm-Kreis","Wildenspring",742]
["Ilm-Kreis","Wipfratal",547]
["Ilm-Kreis","Witzleben",547]
["Ilm-Kreis","Wolfsberg",742]
["Kyffhäuserkreis","Abtsbessingen",490]
["Kyffhäuserkreis","Artern/Unstrut",490]
["Kyffhäuserkreis","Bad Frankenhausen/Kyffhäuser",490]
["Kyffhäuserkreis","Bellstedt",490]
["Kyffhäuserkreis","Borxleben",490]
["Kyffhäuserkreis","Bretleben",490]
["Kyffhäuserkreis","Clingen",490]
["Kyffhäuserkreis","Donndorf",583]
["Kyffhäuserkreis","Ebeleben",532]
["Kyffhäuserkreis","Etzleben",507]
["Kyffhäuserkreis","Freienbessingen",535]
["Kyffhäuserkreis","Gehofen",490]
["Kyffhäuserkreis","Gorsleben",490]
["Kyffhäuserkreis","Greußen",494]
["Kyffhäuserkreis","Großenehrich",532]
["Kyffhäuserkreis","Günserode",689]
["Kyffhäuserkreis","Hauteroda",490]
["Kyffhäuserkreis","Helbedündorf",703]
["Kyffhäuserkreis","Heldrungen",490]
["Kyffhäuserkreis","Hemleben",490]
["Kyffhäuserkreis","Holzsußra",490]
["Kyffhäuserkreis","Ichstedt",490]
["Kyffhäuserkreis","Kalbsrieth",490]
["Kyffhäuserkreis","Kyffhäuserland",490]
["Kyffhäuserkreis","Mönchpfiffel-Nikolausrieth",490]
["Kyffhäuserkreis","Nausitz",490]
["Kyffhäuserkreis","Niederbösa",490]
["Kyffhäuserkreis","Oberbösa",490]
["Kyffhäuserkreis","Oberheldrungen",490]
["Kyffhäuserkreis","Oldisleben",530]
["Kyffhäuserkreis","Reinsdorf",490]
["Kyffhäuserkreis","Ringleben (KYF)",510]
["Kyffhäuserkreis","Rockstedt",490]
["Kyffhäuserkreis","Roßleben",538]
["Kyffhäuserkreis","Sondershausen",569]
["Kyffhäuserkreis","Steinthaleben",579]
["Kyffhäuserkreis","Thüringenhausen",490]
["Kyffhäuserkreis","Topfstedt",490]
["Kyffhäuserkreis","Voigtstedt",490]
["Kyffhäuserkreis","Wasserthaleben",490]
["Kyffhäuserkreis","Westgreußen",490]
["Kyffhäuserkreis","Wiehe",490]
["Kyffhäuserkreis","Wolferschwenda",490]
["Nordhausen","Bleicherode",702]
["Nordhausen","Buchholz",626]
["Nordhausen","Ellrich",743]
["Nordhausen","Etzelsrode",626]
["Nordhausen","Friedrichsthal",674]
["Nordhausen","Görsbach",626]
["Nordhausen","Großlohra",626]
["Nordhausen","Hainrode/Hainleite",626]
["Nordhausen","Harztor",626]
["Nordhausen","Harzungen",626]
["Nordhausen","Heringen",503]
["Nordhausen","Heringen/Helme",556]
["Nordhausen","Herrmannsacker",626]
["Nordhausen","Hohenstein",778]
["Nordhausen","Kehmstedt",626]
["Nordhausen","Kleinbodungen",626]
["Nordhausen","Kleinfurra",626]
["Nordhausen","Kraja",626]
["Nordhausen","Lipprechterode",626]
["Nordhausen","Neustadt/Harz",883]
["Nordhausen","Niedergebra",626]
["Nordhausen","Nohra (NDH)",626,"x"]
["Nordhausen","Nordhausen",608]
["Nordhausen","Sollstedt",735]
["Nordhausen","Urbach",626]
["Nordhausen","Werther",626]
["Nordhausen","Wipperdorf",727]
["Nordhausen","Wolkramshausen",596]
["Saale-Holzland-Kreis","Albersdorf",589]
["Saale-Holzland-Kreis","Altenberga",589]
["Saale-Holzland-Kreis","Bad Klosterlausnitz",589]
["Saale-Holzland-Kreis","Bibra (SHK)",589]
["Saale-Holzland-Kreis","Bobeck",720]
["Saale-Holzland-Kreis","Bollberg",589]
["Saale-Holzland-Kreis","Bremsnitz",589]
["Saale-Holzland-Kreis","Bucha (SHK)",589]
["Saale-Holzland-Kreis","Bürgel",633]
["Saale-Holzland-Kreis","Crossen",649]
["Saale-Holzland-Kreis","Dornburg-Camburg",664]
["Saale-Holzland-Kreis","Eichenberg (SOK)",589]
["Saale-Holzland-Kreis","Eineborn",589]
["Saale-Holzland-Kreis","Eisenberg",589]
["Saale-Holzland-Kreis","Frauenprießnitz",589]
["Saale-Holzland-Kreis","Freienorla",567]
["Saale-Holzland-Kreis","Geisenhain",589]
["Saale-Holzland-Kreis","Gneus",589]
["Saale-Holzland-Kreis","Golmsdorf",589]
["Saale-Holzland-Kreis","Gösen",589]
["Saale-Holzland-Kreis","Graitschen b. Bürgel",589]
["Saale-Holzland-Kreis","Großbockeda",589]
["Saale-Holzland-Kreis","Großeutersdorf",589]
["Saale-Holzland-Kreis","Großlöbichau",589]
["Saale-Holzland-Kreis","Großpürschütz",589]
["Saale-Holzland-Kreis","Gumperda",589]
["Saale-Holzland-Kreis","Hainichen",589]
["Saale-Holzland-Kreis","Hainspitz",589]
["Saale-Holzland-Kreis","Hartmannsdorf (SHK)",641]
["Saale-Holzland-Kreis","Heideland",589]
["Saale-Holzland-Kreis","Hermsdorf",662]
["Saale-Holzland-Kreis","Hummelshain",613]
["Saale-Holzland-Kreis","Jenalöbnitz",662]
["Saale-Holzland-Kreis","Kahla",578]
["Saale-Holzland-Kreis","Karlsdorf",662]
["Saale-Holzland-Kreis","Kleinbockedra",662]
["Saale-Holzland-Kreis","Kleinebersdorf",662]
["Saale-Holzland-Kreis","Kleineutersdorf",662,"x"]
["Saale-Holzland-Kreis","Laasdorf",662]
["Saale-Holzland-Kreis","Lehesten (SHK)",662]
["Saale-Holzland-Kreis","Lindig",662]
["Saale-Holzland-Kreis","Lippersdorf-Erdmannsdorf",662]
["Saale-Holzland-Kreis","Löberschütz",662]
["Saale-Holzland-Kreis","Mertendorf",667]
["Saale-Holzland-Kreis","Meusebach",662]
["Saale-Holzland-Kreis","Milda",662]
["Saale-Holzland-Kreis","Möckern",662]
["Saale-Holzland-Kreis","Mörsdorf",662]
["Saale-Holzland-Kreis","Nausnitz",662]
["Saale-Holzland-Kreis","Neuengönna",662]
["Saale-Holzland-Kreis","Oberbodnitz",662]
["Saale-Holzland-Kreis","Orlamünde",662]
["Saale-Holzland-Kreis","Ottendorf",676]
["Saale-Holzland-Kreis","Petersberg",662]
["Saale-Holzland-Kreis","Poxdorf",662]
["Saale-Holzland-Kreis","Quirla",662]
["Saale-Holzland-Kreis","Rattelsdorf",662]
["Saale-Holzland-Kreis","Rauda",662]
["Saale-Holzland-Kreis","Rauschwitz",662]
["Saale-Holzland-Kreis","Rausdorf",662]
["Saale-Holzland-Kreis","Reichenbach",662]
["Saale-Holzland-Kreis","Reinstädt",662]
["Saale-Holzland-Kreis","Renthendorf",662]
["Saale-Holzland-Kreis","Rothenstein",662]
["Saale-Holzland-Kreis","Ruttersdorf-Lotschen",631]
["Saale-Holzland-Kreis","Scheiditz",662]
["Saale-Holzland-Kreis","Schkölen",667]
["Saale-Holzland-Kreis","Schleifreisen",662]
["Saale-Holzland-Kreis","Schlöben",662]
["Saale-Holzland-Kreis","Schöngleina",662]
["Saale-Holzland-Kreis","Schöps",662]
["Saale-Holzland-Kreis","Seitenroda",662]
["Saale-Holzland-Kreis","Serba",662]
["Saale-Holzland-Kreis","Silbitz",662]
["Saale-Holzland-Kreis","St.Gangloff",662]
["Saale-Holzland-Kreis","Stadtroda",631]
["Saale-Holzland-Kreis","Sulza",662]
["Saale-Holzland-Kreis","Tautenburg",662]
["Saale-Holzland-Kreis","Tautendorf",662]
["Saale-Holzland-Kreis","Tautenhain",662]
["Saale-Holzland-Kreis","Thierschneck",662]
["Saale-Holzland-Kreis","Tissa",662]
["Saale-Holzland-Kreis","Tröbnitz",662,"x"]
["Saale-Holzland-Kreis","Trockenborn-Wolfersdorf",662]
["Saale-Holzland-Kreis","Unterbodnitz",662]
["Saale-Holzland-Kreis","Waldeck",662]
["Saale-Holzland-Kreis","Walpernhain",662]
["Saale-Holzland-Kreis","Waltersdorf",662]
["Saale-Holzland-Kreis","Weißbach",662]
["Saale-Holzland-Kreis","Weißenborn",662]
["Saale-Holzland-Kreis","Wichmar",662]
["Saale-Holzland-Kreis","Zimmern",662]
["Saale-Holzland-Kreis","Zöllnitz",662]
["Saale-Orla-Kreis","Bad Lobenstein",871]
["Saale-Orla-Kreis","Birkenhügel",871]
["Saale-Orla-Kreis","Blankenberg",871]
["Saale-Orla-Kreis","Blankenstein",769]
["Saale-Orla-Kreis","Bodelwitz",871]
["Saale-Orla-Kreis","Bucha (SOK)",618]
["Saale-Orla-Kreis","Burgk",719]
["Saale-Orla-Kreis","Crispendorf",719]
["Saale-Orla-Kreis","Dittersdorf",719]
["Saale-Orla-Kreis","Döbritz",719]
["Saale-Orla-Kreis","Dreba",719]
["Saale-Orla-Kreis","Dreitzsch",719]
["Saale-Orla-Kreis","Eßbach",719]
["Saale-Orla-Kreis","Gefell",1060]
["Saale-Orla-Kreis","Geroda",719]
["Saale-Orla-Kreis","Gertewitz",719]
["Saale-Orla-Kreis","Görkwitz",719]
["Saale-Orla-Kreis","Göschitz",682]
["Saale-Orla-Kreis","Gössitz",719]
["Saale-Orla-Kreis","Grobengereuth",719]
["Saale-Orla-Kreis","Harra",871]
["Saale-Orla-Kreis","Hirschberg",747]
["Saale-Orla-Kreis","Keila",719]
["Saale-Orla-Kreis","Kirschkau",719]
["Saale-Orla-Kreis","Knau",697]
["Saale-Orla-Kreis","Kospoda",662]
["Saale-Orla-Kreis","Krölpa",566]
["Saale-Orla-Kreis","Langenorla",662]
["Saale-Orla-Kreis","Lausnitz b. Neustadt an der Orla",566]
["Saale-Orla-Kreis","Lemnitz",662]
["Saale-Orla-Kreis","Linda b. Neustadt an der Orla",662]
["Saale-Orla-Kreis","Löhma",662]
["Saale-Orla-Kreis","Miesitz",662,"x"]
["Saale-Orla-Kreis","Mittelpöllnitz",662]
["Saale-Orla-Kreis","Moßbach",662]
["Saale-Orla-Kreis","Moxa",662]
["Saale-Orla-Kreis","Neundorf (bei Lobenstein)",871]
["Saale-Orla-Kreis","Neundorf (bei Schleiz)",719]
["Saale-Orla-Kreis","Neustadt an der Orla",648]
["Saale-Orla-Kreis","Nimritz",662]
["Saale-Orla-Kreis","Oberoppurg",662]
["Saale-Orla-Kreis","Oettersdorf",662]
["Saale-Orla-Kreis","Oppurg",662]
["Saale-Orla-Kreis","Paska",662]
["Saale-Orla-Kreis","Peuschen",662]
["Saale-Orla-Kreis","Pillingsdorf",662]
["Saale-Orla-Kreis","Plothen",662]
["Saale-Orla-Kreis","Pößneck",662]
["Saale-Orla-Kreis","Pottiga",662]
["Saale-Orla-Kreis","Quaschwitz",662]
["Saale-Orla-Kreis","Ranis",662]
["Saale-Orla-Kreis","Remptendorf",696]
["Saale-Orla-Kreis","Rosendorf",662]
["Saale-Orla-Kreis","Saalburg-Ebersdorf",719]
["Saale-Orla-Kreis","Schlegel",871]
["Saale-Orla-Kreis","Schleiz",719]
["Saale-Orla-Kreis","Schmieritz",662]
["Saale-Orla-Kreis","Schmorda",662]
["Saale-Orla-Kreis","Schöndorf",662]
["Saale-Orla-Kreis","Seisla",662]
["Saale-Orla-Kreis","Solkwitz",662]
["Saale-Orla-Kreis","Stanau",662]
["Saale-Orla-Kreis","Tanna",752]
["Saale-Orla-Kreis","Tegau",662]
["Saale-Orla-Kreis","Tömmelsdorf",662]
["Saale-Orla-Kreis","Triptis",662]
["Saale-Orla-Kreis","Volkmannsdorf",662]
["Saale-Orla-Kreis","Weira",662]
["Saale-Orla-Kreis","Wernburg",662]
["Saale-Orla-Kreis","Wilhelmsdorf",566]
["Saale-Orla-Kreis","Wurzbach",1091]
["Saale-Orla-Kreis","Ziegenrück",566]
["Saalfeld-Rudolstadt","Allendorf",637]
["Saalfeld-Rudolstadt","Altenbeuthen",637]
["Saalfeld-Rudolstadt","Arnsgereuth",637]
["Saalfeld-Rudolstadt","Bad Blankenburg",607,"x"]
["Saalfeld-Rudolstadt","Bechstedt",547]
["Saalfeld-Rudolstadt","Cursdorf",637]
["Saalfeld-Rudolstadt","Deesbach",637]
["Saalfeld-Rudolstadt","Döschnitz",637]
["Saalfeld-Rudolstadt","Dröbischau",637]
["Saalfeld-Rudolstadt","Drognitz",723]
["Saalfeld-Rudolstadt","Gräfenthal",964]
["Saalfeld-Rudolstadt","Hohenwarte",566]
["Saalfeld-Rudolstadt","Kamsdorf",566]
["Saalfeld-Rudolstadt","Katzhütte",1067]
["Saalfeld-Rudolstadt","Kaulsdorf",566]
["Saalfeld-Rudolstadt","Königsee-Rottenbach",630]
["Saalfeld-Rudolstadt","Lehesten (SLF)",1091]
["Saalfeld-Rudolstadt","Leutenberg",665]
["Saalfeld-Rudolstadt","Lichte",637]
["Saalfeld-Rudolstadt","Mellenbach-Glasbach",637]
["Saalfeld-Rudolstadt","Meura",637]
["Saalfeld-Rudolstadt","Meuselbach-Schwarzmühle",637]
["Saalfeld-Rudolstadt","Oberhain",637]
["Saalfeld-Rudolstadt","Oberweißbach/Thür. Wald",902]
["Saalfeld-Rudolstadt","Piesau",637]
["Saalfeld-Rudolstadt","Probstzella",776]
["Saalfeld-Rudolstadt","Reichmannsdorf",662]
["Saalfeld-Rudolstadt","Remda-Teichel",591]
["Saalfeld-Rudolstadt","Rohrbach (SLF)",637]
["Saalfeld-Rudolstadt","Rudolstadt",591]
["Saalfeld-Rudolstadt","Saalfeld/Saale",568]
["Saalfeld-Rudolstadt","Saalfelder Höhe",871]
["Saalfeld-Rudolstadt","Schmiedefeld",637]
["Saalfeld-Rudolstadt","Schwarzburg",637]
["Saalfeld-Rudolstadt","Sitzendorf",637]
["Saalfeld-Rudolstadt","Uhlstädt-Kirchhasel",555]
["Saalfeld-Rudolstadt","Unterweißbach",637]
["Saalfeld-Rudolstadt","Unterwellenborn",566]
["Saalfeld-Rudolstadt","Wittgendorf",637]
["Schmalkalden-Meiningen","Altersbach",666]
["Schmalkalden-Meiningen","Aschenhausen",666]
["Schmalkalden-Meiningen","Belrieth",666]
["Schmalkalden-Meiningen","Benshausen",927]
["Schmalkalden-Meiningen","Bermbach",719]
["Schmalkalden-Meiningen","Birx",1009]
["Schmalkalden-Meiningen","Breitungen/Werra",666]
["Schmalkalden-Meiningen","Brotterode-Trusetal",1167,"x"]
["Schmalkalden-Meiningen","Christes",666]
["Schmalkalden-Meiningen","Dillstädt",666]
["Schmalkalden-Meiningen","Einhausen",666]
["Schmalkalden-Meiningen","Ellingshausen",666]
["Schmalkalden-Meiningen","Erbenhausen",1009]
["Schmalkalden-Meiningen","Fambach",666]
["Schmalkalden-Meiningen","Floh-Seligenthal",879]
["Schmalkalden-Meiningen","Frankenheim/Rhön",1009]
["Schmalkalden-Meiningen","Friedelshausen",666]
["Schmalkalden-Meiningen","Grabfeld",666]
["Schmalkalden-Meiningen","Haselbach",1009]
["Schmalkalden-Meiningen","Henneberg",666]
["Schmalkalden-Meiningen","Hümpfershausen",666]
["Schmalkalden-Meiningen","Kaltensundheim",1009]
["Schmalkalden-Meiningen","Kaltenwestheim",1009]
["Schmalkalden-Meiningen","Kühndorf",761]
["Schmalkalden-Meiningen","Leutersdorf",666]
["Schmalkalden-Meiningen","Mehmels",666]
["Schmalkalden-Meiningen","Meiningen",666]
["Schmalkalden-Meiningen","Melpers",1009]
["Schmalkalden-Meiningen","Metzels",666]
["Schmalkalden-Meiningen","Neubrunn",666]
["Schmalkalden-Meiningen","Oberhof",666]
["Schmalkalden-Meiningen","Oberkatz",666]
["Schmalkalden-Meiningen","Obermaßfeld-Grimmenthal",666]
["Schmalkalden-Meiningen","Oberschönau",1119]
["Schmalkalden-Meiningen","Oberweid",1009]
["Schmalkalden-Meiningen","Oepfershausen",666]
["Schmalkalden-Meiningen","Rhönblick",706]
["Schmalkalden-Meiningen","Rippershausen",666]
["Schmalkalden-Meiningen","Ritschenhausen",683]
["Schmalkalden-Meiningen","Rohr",666]
["Schmalkalden-Meiningen","Rosa",666]
["Schmalkalden-Meiningen","Roßdorf",713]
["Schmalkalden-Meiningen","Rotterode",666]
["Schmalkalden-Meiningen","Schmalkalden",748]
["Schmalkalden-Meiningen","Schwallungen",666]
["Schmalkalden-Meiningen","Schwarza",666]
["Schmalkalden-Meiningen","Springstille",666]
["Schmalkalden-Meiningen","Steinbach-Hallenberg",666]
["Schmalkalden-Meiningen","Stepfershausen",666]
["Schmalkalden-Meiningen","Sülzfeld",666]
["Schmalkalden-Meiningen","Unterkatz",666]
["Schmalkalden-Meiningen","Untermaßfeld",666]
["Schmalkalden-Meiningen","Unterschönau",666,"x"]
["Schmalkalden-Meiningen","Unterweid",1009]
["Schmalkalden-Meiningen","Utendorf",666]
["Schmalkalden-Meiningen","Vachdorf",666]
["Schmalkalden-Meiningen","Viernau",666]
["Schmalkalden-Meiningen","Wahns",691]
["Schmalkalden-Meiningen","Wallbach",666]
["Schmalkalden-Meiningen","Walldorf",666]
["Schmalkalden-Meiningen","Wasungen",666]
["Schmalkalden-Meiningen","Wölfershausen",666]
["Schmalkalden-Meiningen","Zella-Mehlis",666]
["Sömmerda","Alperstedt",492]
["Sömmerda","Andisleben",568]
["Sömmerda","Beichlingen",568]
["Sömmerda","Bilzingsleben",490]
["Sömmerda","Büchel",568]
["Sömmerda","Buttstädt",577]
["Sömmerda","Eckstedt",568]
["Sömmerda","Ellersleben",568]
["Sömmerda","Elxleben (SÖM)",568]
["Sömmerda","Eßleben-Teutleben",568]
["Sömmerda","Frömmstedt",568]
["Sömmerda","Gangloffsömmern",568]
["Sömmerda","Gebesee",568]
["Sömmerda","Griefstedt",568]
["Sömmerda","Großbrembach",568]
["Sömmerda","Großmölsen",568]
["Sömmerda","Großneuhausen",568]
["Sömmerda","Großrudestedt",568]
["Sömmerda","Günstedt",568]
["Sömmerda","Guthmannshausen",568]
["Sömmerda","Hardisleben",568]
["Sömmerda","Haßleben",568]
["Sömmerda","Henschleben",568]
["Sömmerda","Herrnschwende",568]
["Sömmerda","Kannawurf",568]
["Sömmerda","Kindelbrück",507]
["Sömmerda","Kleinbrembach",568]
["Sömmerda","Kleinmölsen",568]
["Sömmerda","Kleinneuhausen",568]
["Sömmerda","Kölleda",568]
["Sömmerda","Mannstedt",568]
["Sömmerda","Markvippach",568]
["Sömmerda","Nöda",568]
["Sömmerda","Olbersleben",568]
["Sömmerda","Ollendorf",568,"x"]
["Sömmerda","Ostramondra",568]
["Sömmerda","Rastenberg",568]
["Sömmerda","Riethgen",568]
["Sömmerda","Riethnordhausen",568]
["Sömmerda","Ringleben (SÖM)",568]
["Sömmerda","Rudersdorf",568]
["Sömmerda","Schillingstedt",568]
["Sömmerda","Schloßvippach",514]
["Sömmerda","Schwerstedt (SÖM)",568]
["Sömmerda","Sömmerda",508]
["Sömmerda","Sprötau",568]
["Sömmerda","Straußfurt",531]
["Sömmerda","Udestedt",527]
["Sömmerda","Vogelsberg",568]
["Sömmerda","Walschleben",568]
["Sömmerda","Weißensee",531]
["Sömmerda","Werningshausen",568]
["Sömmerda","Witterda",568]
["Sömmerda","Wundersleben",568]
["Sonneberg","Bachfeld",1060]
["Sonneberg","Föritz",813]
["Sonneberg","Frankenblick",1051]
["Sonneberg","Goldisthal",1060]
["Sonneberg","Judenbach",1022]
["Sonneberg","Lauscha",1060]
["Sonneberg","Neuhaus am Rennweg",1306]
["Sonneberg","Neuhaus-Schierschnitz",903]
["Sonneberg","Schalkau",1060]
["Sonneberg","Scheibe-Alsbach",1180]
["Sonneberg","Sonneberg",1021]
["Sonneberg","Steinach",1060]
["Sonneberg","Steinheid",1302]
["Stadt Eisenach","Eisenach",765]
["Stadt Erfurt","Erfurt",547]
["Stadt Gera","Gera",627]
["Stadt Jena","Jena",630]
["Stadt Suhl","Suhl",1095]
["Stadt Weimar","Weimar",591]
["Unstrut-Hainich-Kreis","Altengottern",581]
["Unstrut-Hainich-Kreis","Anrode",706]
["Unstrut-Hainich-Kreis","Bad Langensalza",534]
["Unstrut-Hainich-Kreis","Bad Tennstedt",523]
["Unstrut-Hainich-Kreis","Ballhausen",581]
["Unstrut-Hainich-Kreis","Blankenburg",581,"x"]
["Unstrut-Hainich-Kreis","Bothenheilingen",581]
["Unstrut-Hainich-Kreis","Bruchstedt",581]
["Unstrut-Hainich-Kreis","Dünwald",750]
["Unstrut-Hainich-Kreis","Flarchheim",581]
["Unstrut-Hainich-Kreis","Großengottern",581]
["Unstrut-Hainich-Kreis","Großvargula",581]
["Unstrut-Hainich-Kreis","Haussömmern",581]
["Unstrut-Hainich-Kreis","Herbsleben",534]
["Unstrut-Hainich-Kreis","Heroldishausen",581]
["Unstrut-Hainich-Kreis","Heyerode",834]
["Unstrut-Hainich-Kreis","Hornsömmern",581]
["Unstrut-Hainich-Kreis","Issersheilingen",581]
["Unstrut-Hainich-Kreis","Kammerforst",754]
["Unstrut-Hainich-Kreis","Katharinenberg",783]
["Unstrut-Hainich-Kreis","Kirchheilingen",581]
["Unstrut-Hainich-Kreis","Kleinwelsbach",581]
["Unstrut-Hainich-Kreis","Klettstedt",581]
["Unstrut-Hainich-Kreis","Körner",581]
["Unstrut-Hainich-Kreis","Kutzleben",523]
["Unstrut-Hainich-Kreis","Marolterode",581]
["Unstrut-Hainich-Kreis","Menteroda",581]
["Unstrut-Hainich-Kreis","Mittelsömmern",581]
["Unstrut-Hainich-Kreis","Mühlhausen/Thüringen",581]
["Unstrut-Hainich-Kreis","Mülverstedt",581]
["Unstrut-Hainich-Kreis","Neunheilingen",581]
["Unstrut-Hainich-Kreis","Obermehler",581]
["Unstrut-Hainich-Kreis","Oppershausen",581]
["Unstrut-Hainich-Kreis","Rodeberg",581]
["Unstrut-Hainich-Kreis","Schlotheim",581]
["Unstrut-Hainich-Kreis","Schönstedt",581]
["Unstrut-Hainich-Kreis","Südeichsfeld",581]
["Unstrut-Hainich-Kreis","Sundhausen",581]
["Unstrut-Hainich-Kreis","Tottleben",581]
["Unstrut-Hainich-Kreis","Unstruttal",581]
["Unstrut-Hainich-Kreis","Urleben",581]
["Unstrut-Hainich-Kreis","Vogtei",581]
["Unstrut-Hainich-Kreis","Weberstedt",581]
["Unstrut-Hainich-Kreis","Weinbergen",581]
["Wartburgkreis","Bad Liebenstein",719]
["Wartburgkreis","Bad Salzungen",622]
["Wartburgkreis","Barchfeld-Immelborn",719]
["Wartburgkreis","Berka v. d. Hainich",765]
["Wartburgkreis","Berka/Werra",765]
["Wartburgkreis","Bischofroda",719]
["Wartburgkreis","Brunnhartshausen",719,"x"]
["Wartburgkreis","Buttlar",719]
["Wartburgkreis","Creuzburg",765]
["Wartburgkreis","Dankmarshausen",719]
["Wartburgkreis","Dermbach",866]
["Wartburgkreis","Diedorf/Rhön",719]
["Wartburgkreis","Dippach",719]
["Wartburgkreis","Ebenshausen",719]
["Wartburgkreis","Empfertshausen",719]
["Wartburgkreis","Ettenhausen a.d. Suhl",719]
["Wartburgkreis","Fischbach/Rhön",719]
["Wartburgkreis","Frankenroda",719]
["Wartburgkreis","Frauensee",719]
["Wartburgkreis","Geisa",733]
["Wartburgkreis","Gerstengrund",719]
["Wartburgkreis","Gerstungen",765]
["Wartburgkreis","Großensee",719]
["Wartburgkreis","Hallungen",719]
["Wartburgkreis","Hörselberg-Hainich",675]
["Wartburgkreis","Ifta",719]
["Wartburgkreis","Kaltennordheim",1009]
["Wartburgkreis","Klings",825]
["Wartburgkreis","Krauthausen",719]
["Wartburgkreis","Krayenberggemeinde",719]
["Wartburgkreis","Lauterbach",719]
["Wartburgkreis","Leimbach",719]
["Wartburgkreis","Marksuhl",678]
["Wartburgkreis","Mihla",654]
["Wartburgkreis","Moorgrund",719]
["Wartburgkreis","Nazza",719]
["Wartburgkreis","Neidhartshausen",719]
["Wartburgkreis","Oechsen",719]
["Wartburgkreis","Ruhla",901]
["Wartburgkreis","Schleid",719]
["Wartburgkreis","Schweina",719]
["Wartburgkreis","Seebach",594]
["Wartburgkreis","Stadtlengsfeld",719]
["Wartburgkreis","Tiefenort",719]
["Wartburgkreis","Treffurt",765]
["Wartburgkreis","Unterbreizbach",719]
["Wartburgkreis","Urnshausen",719]
["Wartburgkreis","Vacha",719]
["Wartburgkreis","Weilar",719]
["Wartburgkreis","Wiesenthal",719]
["Wartburgkreis","Wolfsburg-Unkeroda",719]
["Wartburgkreis","Wutha-Farnroda",765,"x"]
["Wartburgkreis","Zella/Rhön",719]
["Weimar-Land","Apolda",591]
["Weimar-Land","Bad Berka",640]
["Weimar-Land","Bad Sulza",556]
["Weimar-Land","Bechstedtstraß",591]
["Weimar-Land","Berlstedt",591]
["Weimar-Land","Blankenhain",656]
["Weimar-Land","Buchfart",591]
["Weimar-Land","Buttelstedt",566]
["Weimar-Land","Daasdorf a. Berge",591]
["Weimar-Land","Döbritschen",591]
["Weimar-Land","Eberstedt",591]
["Weimar-Land","Ettersburg",634]
["Weimar-Land","Frankendorf",591]
["Weimar-Land","Großheringen",591]
["Weimar-Land","Großobringen",591]
["Weimar-Land","Großschwabhausen",591]
["Weimar-Land","Hammerstedt",591]
["Weimar-Land","Heichelheim",591]
["Weimar-Land","Hetschburg",591]
["Weimar-Land","Hohenfelden",591]
["Weimar-Land","Hopfgarten",591]
["Weimar-Land","Ilmtal-Weinstraße",591]
["Weimar-Land","Isseroda",591]
["Weimar-Land","Kapellendorf",591]
["Weimar-Land","Kiliansroda",591]
["Weimar-Land","Kleinobringen",591]
["Weimar-Land","Kleinschwabhausen",591]
["Weimar-Land","Klettbach",591]
["Weimar-Land","Ködderitzsch",591]
["Weimar-Land","Kranichfeld",591]
["Weimar-Land","Krautheim",591]
["Weimar-Land","Kromsdorf",591]
["Weimar-Land","Lehnstedt",591]
["Weimar-Land","Magdala",600]
["Weimar-Land","Mechelroda",636]
["Weimar-Land","Mellingen",591]
["Weimar-Land","Mönchenholzhausen",567]
["Weimar-Land","Nauendorf",591]
["Weimar-Land","Neumark",591]
["Weimar-Land","Niedertrebra",591]
["Weimar-Land","Niederzimmern",591]
["Weimar-Land","Nohra (AP)",591]
["Weimar-Land","Obertrebra",591]
["Weimar-Land","Oettern",591,"x"]
["Weimar-Land","Ottstedt a. Berge",591]
["Weimar-Land","Ramsla",591]
["Weimar-Land","Rannstedt",591]
["Weimar-Land","Rittersdorf",591]
["Weimar-Land","Rohrbach (AP)",591]
["Weimar-Land","Saaleplatte",664]
["Weimar-Land","Sachsenhausen",591]
["Weimar-Land","Schmiedehausen",591]
["Weimar-Land","Schwerstedt (AP)",568]
["Weimar-Land","Tonndorf",591]
["Weimar-Land","Troistedt",591]
["Weimar-Land","Umpferstedt",591]
["Weimar-Land","Vippachedelhausen",514]
["Weimar-Land","Vollersroda",591]
["Weimar-Land","Wiegendorf",591]
["Weimar-Land","Wohlsborn",591]

{"sheet":"Ergebnis","index":9,"n_rows":29,"n_cols":19,"rows_kept":29,"cut":false,"hidden":true,"merged":[[27,10,27,18]]}
[null,"Berechnungsschema / Ergebnisbeleg – Ermittlung Lagerkapazität"]
[null,null,"Einheit","Wert",null,"Betrieb:"]
[null,null,null,null,null,null,"Mustermann"]
[1,"anzurechnender Jahresniederschlag (Durchschn. langjähriges Niederschlagsmittel abzüglich 30 % Verdunstung)  ","m³/m² * Jahr",{"$f":"0.7*Betrieb!$F$4/1000","v":0.7},null,"Unternehmensnummer:",null,{"$f":"Deckblatt!E25","v":160000000000},{"$f":"Deckblatt!F25","v":0},{"$f":"Deckblatt!G25","v":0},{"$f":"Deckblatt!H25","v":0},{"$f":"Deckblatt!I25","v":0},{"$f":"Deckblatt!J25","v":0},{"$f":"Deckblatt!K25","v":0},{"$f":"Deckblatt!L25","v":0},{"$f":"Deckblatt!M25","v":0},{"$f":"Deckblatt!N25","v":0},{"$f":"Deckblatt!O25","v":0},{"$f":"Deckblatt!P25","v":0}]
[2,"Lagerkapazitätsberechnung für Festmist und feste Gärreste","--"]
[3,"Lagerraum im Stall (Tiefstreu)","m³",{"$f":"Betrieb!$M$24","v":0},null,"Die Berechnung erfolgte auf der Grundlage "]
[4," + Lagerraum Festmistlager","m³",{"$f":"Betrieb!$T$24","v":0},null,"der Angaben/Daten vom:"]
[5," = Summe verfügbarer Lagerraum","m³",{"$f":"D7+D6","v":0}]
[6,"Summe Anfall Festmist und feste Gärreste pro Tag (Anfall Tabelle 1  / 30)","m³/Tag",{"$f":"Betrieb!$J$8/((Betrieb!$A$7)*30)","v":{"$error":"#DIV/0!"}},null,null,null,"(Datenerfassung)"]
[7,"Lagerkapazität Festmist, f. Gärreste - Lagerraum m³ (Z. 5) /Anfall m³/Tag (Z. 6)","Tage",{"$f":"D8/D9","v":{"$error":"#DIV/0!"}}]
[8,"Lagerkapazitätsberechnung für Flüssigmist und flüssige Gärreste","--",null,null,"entsprechend den Hinweisen des  "]
[9,"Lagerraum (Bruttorauminhalt)","m³",{"$f":"Betrieb!$L$58-Betrieb!$Q$51","v":0},null,"Sächsischen Staatsministeriums für Umwelt und Landwirtschaft"]
[10,"    - Freibord und ggf. Restfüllstand zu Zeile 9","m³",{"$f":"(Betrieb!$L$58-Betrieb!$Q$51)-(Betrieb!$M$58-Betrieb!$Q$49)","v":0},null,"zur Ermittlung des Fassungsvermögens von Anlagen zur Lagerung"]
[11,"   + anrechenbare Staukanäle ","m³",{"$f":"Betrieb!$Q$49","v":0},null,"von Wirtschaftsdüngern und Gärresten in Umsetzung von"]
[12," = verfügbarer Lagerraum Flüssigmiste","m³",{"$f":"D12-D13+D14","v":0},null,"§ 12 der Düngeverordnung (DüV) vom 01.08.2017"]
[13,"Summe Anfall Flüssigmist (Gülle,Jauche) pro Tag","m³/Tag",{"$f":"Betrieb!$Q$53","v":0}]
[14," + Anfall Melkhausabwasser pro Tag (0,0085 m³ / Kuhplatz * Tag bzw. 0,0015 m³ / Milchschaf- / Milchziegenplatz * Tag)","m³/Tag",{"$f":"(Lager_Ri!$G$10+Lager_Schaf!$F$32)/((Betrieb!$A$41+5)*30)","v":0},null,"Anlagen:"]
[15,"Einträge (Niederschlags- bzw. Oberflächenwasser, Abwasser, Silosickersaft, Gärreste):","--",null,null,null,null,null,"Datenerfassungsblätter"]
[16," + auf alle Oberflächen nicht wasserdicht abgedeckter Läger (Festmist, Gülle, Jauche)","m³/Tag",{"$f":"(Betrieb!$J$20+Betrieb!$V$58)/((Betrieb!$A$41+5)*30)","v":0}]
[17," + auf die Hälfte der Oberfläche Siloanlage (wenn eingeleitet wird)","m³/Tag",{"$f":"Betrieb!$U$27/((Betrieb!$A$41+5)*30)","v":0}]
[18," + auf alle sonstige befestigten Flächen (wenn eingeleitet wird)","m³/Tag",{"$f":"Betrieb!$U$24/((Betrieb!$A$41+5)*30)","v":0}]
[19," + sonstige Abwässer","m³/Tag",0]
[20," + eingeleitete Gärrückstände","m³/Tag",{"$f":"Betrieb!$J$39/((Betrieb!$A$41+5)*30)","v":0}]
[21," - Minderanfall (laut gesondertem Nachweis)","m³/Tag",0]
[22," + Anfall Silosickersaft (wenn eingeleitet wird)","m³/Tag",{"$f":"Betrieb!$U$29/((Betrieb!$A$41+5)*30)","v":0}]
[23," = Summe Anfall Flüssigmist pro Tag","m³/Tag",{"$f":"16:16+17:17+19:19+20:20+21:21+22:22+23:23+24:24+25:25","v":0}]
[24,"Lagerraumbedarf für 180 Tage (Zeile 23 * 180)","m³",{"$f":"$D$26*180","v":0}]
[25,"Lagerkapazität ((Lagerraum m³, Zeile12 – Anfall Silosickersaft m³, Zeile 22) / Summe Anfall Wirtschaftsdünger m³/ Tag, Zeile 2)","Tage",{"$f":"($D$15/$D$26)","v":{"$error":"#DIV/0!"}},null,"Ort/Datum                         ",null,null,null,null," Unterschrift Bearbeiter Stempel  LfULG  "]
[26,"fehlender Lagerraum","  %",{"$f":"100-$D$15*100/$D$27","v":{"$error":"#DIV/0!"}}]

{"sheet":"Tipla_Mi","index":10,"n_rows":46,"n_cols":8,"rows_kept":46,"cut":false,"hidden":false,"merged":[]}
["Betrieb:",null,{"$f":"Deckblatt!E15","v":" "},null,null,"Variante:",1,{"$f":"Deckblatt!O31","v":" "}]
["Tierbestands- und Tierplatzkalkulation für die Milchproduktion"]
["Ausgangsbedingungen:",null,null,"R","Referenzmenge = R",null,"Tierplätze = T"]
[{"$f":"IF(D3=\"R\",\"Referenzmenge Milch in kg:\",\"Tierplätze gesamt:\")","v":"Referenzmenge Milch in kg:"},null,null,1000000,"bei Fett %",null,null,4.1500000000000004]
["Milchleistung (Markt) kg/T.u.a",null,null,10000,"bei Fett %",null,null,4.1500000000000004]
["Tierbestand:",null,"Kühe",{"$f":"IF(D3=\"T\",INT(C19+C22),ROUND((D4*H4)/(D5*H5),0))","v":100},"eigene Reproduktion J/N ?",null,null,"j"]
["Reproduktionsrate in %:",null,null,35,{"$f":"IF(H6=\"J\",\"Färsenverkauf J/N ?\",\"\")","v":"Färsenverkauf J/N ?"},null,null,"j"]
["Abkalberate in %:",null,null,105,{"$f":"IF(H7=\"j\",\"Spermasexing Färsen J/N ?\",\"\")","v":"Spermasexing Färsen J/N ?"},null,null,"n"]
["Zwischenkalbezeit in Tagen:",null,null,415,{"$f":"IF(H8=\"j\",\"  Anteil weibl. Kälber in %\",\"\")","v":""}]
["Laktationstage gesamt:",null,null,{"$f":"D9-H10","v":359},"Trockenstehzeit in Tagen:",null,null,56]
["  dav.  im Abkalbebereich:",null,null,1,"  dav. im Abkalbebereich:",null,null,5]
["Haltungsdauer Ko-Kälber (Tage):",null,null,14,"Kälberverluste Ko in %",null,null,12]
["Ausstallungsrhythmus der Kälber in d",null,null,14,{"$f":"IF(H8=\"j\",\"\",IF(E43>D6*D8/100*((100-H12)/100)*0.49,\"Achtung: Anz. Weibl. Kälber nicht ausreichend !\",\"\"))","v":""}]
["Abkalbe-","Jan","Feb","März","April","Mai","Juni","Maximum"]
["verlauf %",9,9,9,8,8,7,{"$f":"MAXA(B15:G15,B17:G17,)","v":9}]
["Summe","Juli","Aug","Sept","Okt","Nov","Dez","Minimum"]
[{"$f":"SUM(B15:G15)+SUM(B17:G17)","v":100},7,8,8,9,9,9,{"$f":"MINA(B15:G15,B17:G17)","v":7}]
[null,null,"Durchschn.","Max.","Min.","Tierplätze",null,"Auslastung "]
["Kühe laktierend:",null,{"$f":"C21+C20","v":86.506024096385531},null,null,{"$f":"INT(F20+F21+0.5)","v":88},null,"%"]
["dav. Produkt.-bereich:",null,{"$f":"IF(D3=\"T\",F20/100*H20,(D10-D11)/D9*D6)","v":86.265060240963848},{"$f":"C19-E21","v":86.275887110084156},{"$f":"C19-D21","v":86.210133673591017},{"$f":"IF(D3=\"T\",INT(D4-C27)/D9*(D10-D11),C20/H20*100)","v":87.578741361384616},null,98.5]
["dav. Abkalbebereich:",null,{"$f":"IF(D3=\"T\",F21/100*H21,D11/(D10+H10)*D6)","v":0.24096385542168677},{"$f":"D11/365*D6*H15/8.333333","v":0.29589042279452105},{"$f":"D11/365*D6*H17/(100/12)","v":0.23013698630136983},{"$f":"IF(D3=\"T\",(D4-C27)/D9*D11,D21/H21*100)","v":0.49315070465753513},null,60]
["Kühe trocken:",null,{"$f":"C24+C23","v":13.493975903614459},null,null,{"$f":"INT(F23+F24+0.5)","v":15}]
["dav. Produkt.-bereich:",null,{"$f":"IF(D3=\"T\",F23/100*H23,(H10-H11)/(D10+H10)*D6)","v":12.289156626506024},{"$f":"C22-E24","v":12.481927710843374},{"$f":"C22-D24","v":12.19277108433735},{"$f":"IF(D3=\"T\",(D4-C27)/D9*(H10-H11),C23/H23*100)","v":13.073570879261728},null,94]
["dav. Abkalbebereich:",null,{"$f":"IF(D3=\"T\",F24/100*H24,H11/(H10+D10)*D6)","v":1.2048192771084338},{"$f":"C24*H15/(100/12)","v":1.3012048192771086},{"$f":"C24*H17/(100/12)","v":1.0120481927710843},{"$f":"IF(D3=\"T\",(D4-C27)/D9*H11,D24/H24*100)","v":2.3658269441401978},"Stalleinh.",55]
["Kälber (K0)",null,{"$f":"INT(D6*D8/100*D12/365+0.5)","v":4},{"$f":"C25*H15/(100/12)","v":4.3199999999999994},{"$f":"C25*H17/(100/12)","v":3.36},{"$f":"INT(D6*D8/100/D9*D13/H25*100+0.5)","v":4},{"$f":"INT((D12+D13+4)/D13+0.5)","v":2},80]
["Kuhplätze gesamt :",null,{"$f":"H26+H27+C27","v":106},null,null,"dav.  Produkt-.bereich:",null,{"$f":"INT(F23+F20+0.5)","v":101}]
["dav. Krankenplätze :",null,{"$f":"IF(D3=\"T\",INT(D4*D27/100),INT(D6*D27/100))","v":2},2,"%","dav. Abkalbebereich:",null,{"$f":"INT(F24+F21+0.5)","v":3}]
["Kälberplätze (K0) :",null,{"$f":"(F25*G25)","v":8},null,null,"oder Kälberhütten",null,{"$f":"D6*D8/100/D9*(D12+10)","v":6.0722891566265051}]
[{"$f":"IF(H6=\"J\",IF(H7=\"J\",\"Tierbestände und Tierplätze für Kälber und Jungrinder - Verkauf von Färsen\",\"Tierbestände und Tierplätze für Kälber und Jungrinder - eigene Reproduktion\"),\"\")","v":"Tierbestände und Tierplätze für Kälber und Jungrinder - Verkauf von Färsen"}]
["Reproduktions-",null,"Haltungs-","Selektion/","jährlicher","Durchschn.-"," Anzahl","Stallplatz-"]
["rate",null,"dauer ","Verluste",{"$f":"IF(H7=\"J\",\"Anfall\",\"Bedarf\")","v":"Anfall"},"bestand"," Tierpl.","auslastung"]
[{"$f":"D7/100","v":0.35},null,"Tage","%","Tiere","Tiere"," Stck.","%"]
["trag. Färsen",null,120,1,{"$f":"IF(H6=\"J\",IF(H7=\"J\",E35*((100-D35)/100),D6*D7/100),0)","v":41.317347701321992},{"$f":"ROUND(E33*C33/365,0)","v":14},{"$f":"INT(F33/(H33/100))","v":15},93]
["24.-27.Monat"]
["Jungrinder z. Bes.",null,150,5,{"$f":"IF(H6=\"J\",IF(H7=\"J\",E37*((100-D37)/100),E33/((100-D35)/100)),0)","v":43.491944948759993},{"$f":"ROUND(E35*C35/365,0)","v":18},{"$f":"INT(F35/(H35/100))","v":18},95]
["19.-23. Monat"]
["Jungrinder",null,180,1,{"$f":"IF(H6=\"J\",IF(H7=\"J\",E39*((100-D39)/100),E35/((100-D37)/100)),0)","v":43.931257523999996},{"$f":"ROUND(E37*C37/365,0)","v":22},{"$f":"INT(F37/(H37/100))","v":22},97.5]
["13.-18.Monat"]
["Jungrinder",null,180,1,{"$f":"IF(H6=\"J\",IF(H7=\"J\",E41*((100-D41)/100),E37/((100-D39)/100)),0)","v":44.375007599999996},{"$f":"ROUND(E39*C39/365,0)","v":22},{"$f":"INT(F39/(H39/100))","v":22},98]
["7.-12.Monat"]
["Absatzkälber",null,90,1,{"$f":"IF(H6=\"J\",IF(H7=\"J\",E43*((100-D43)/100),E39/((100-D41)/100)),0)","v":44.823239999999998},{"$f":"ROUND(E41*C41/365,0)","v":11},{"$f":"INT(F41/(H41/100))","v":11},92]
["4.-6. Monat"]
["Tränkkälber",null,80,1,{"$f":"IF(H6=\"J\",IF(H7=\"J\",IF(H8=\"j\",(D6*(D8/100)*0.49+D6*(D7/100)*IF(H9=\"\",0,(H9-49)/100))*(100-H12)/100,D6*(D8/100)*0.49*(100-H12)/100),E41/((100-D43)/100)),0)","v":45.275999999999996},{"$f":"ROUND(E43*C43/365,0)","v":10},{"$f":"INT(F43/(H43/100))","v":11},90]
["3. Wo. -3. Mo."]
["Repodukt. ges.:",null,{"$f":"SUM(C33:C44)","v":800},null,null,{"$f":"SUM(F33:F44)","v":97},{"$f":"SUM(G33:G44)","v":99}]
["Entwickler: LfULG, Th. Heidenreich"]

{"sheet":"TIPLA_S","index":11,"n_rows":54,"n_cols":9,"rows_kept":54,"cut":false,"hidden":false,"merged":[]}
["Betrieb:",{"$f":"Deckblatt!E15","v":" "},null,null,null,"Variante:",1,{"$f":"Deckblatt!O31","v":" "}]
[]
["Tierbestands- und Tierplatzkalkulation Schweineproduktion"]
["Ausgangsbedingungen:",null,"s","Anz. prod. Sauen =S",null,"Läufer/Prod.-rhyth.=L",null,"Abferkelplätze=A"]
[]
[{"$f":"IF(C4=\"s\",\"Anzahl produkt. Sauen:\",IF(C4=\"L\",\"prod. Läufer/Prod.-rhythm.:\",\"Abferkelplätze:\"))","v":"Anzahl produkt. Sauen:"},null,1000,"Stück",null,"Abferkelrate AS",null,82,"%"]
["Durchschnittsbest. Sauen",null,{"$f":"D28+D31+D34","v":1054.2270892096676},"Stück",null,"Abferkelrate JS",null,75,"%"]
["Säugezeit:",null,28,"Tage",null,"Reproduktionsrate",null,26,"%"]
["Produktionsrhythmus:",null,7,{"$f":"IF((B28+B31+B34)/C9=INT((B28+B31+B34)/C9),\"Tage\",\"Produktionsrhythmus nicht möglich!, !Wurfabstand!!\")","v":"Tage"}]
["Wurfabstand",null,{"$f":"C8+5+114","v":147},"Tage",null,"nicht normger. Mastl.",null,2,"%"]
["leb. geb. Ferkel/Wurf",null,10.5,"Stück",null,"Verl. u. Selekt. JS",null,3,"%"]
["Verkaufsmasse Läufer",null,28,"kg",null,"Verluste Ferkel",null,11,"%"]
["LMZ Ferkel:",null,420,"g/Tier*d",null,"Verluste Läufer",null,3,"%"]
["eigene Reproduktion J/N?:",null,"n","Verkauf von Jungsauen J/N ?:",null,null,null,"n"]
[null,null,null,{"$f":"IF(H14=\"J\",\"Anzahl JS/Prod.-rhythm. ?:\",\"\")","v":""}]
["LMZ L1 bei LM kg",60,580,"g/Tier*d",null,"Verluste L1",null,1,"%"]
["LMZ L2 bei LM kg",95,650,"g/Tier*d",null,"Verluste L2",null,1,"%"]
["Selektion L1",null,15.4,"%",null,"Selektion L2",null,0,"%"]
["eigene Mast J/N?:",null,"j"]
["Ausstallungmasse:",null,115,"kg",null,"Verendungen:",null,1,"%"]
["Masttagszunahme:",null,750,"g",null,"Notschlachtungen: ",null,0,"%"]
["Ergebnisse:"]
["Produkt.-","Produk-","Prozeß-","Tierbestand (Stück)",null,"Stall-","Tierplätze (Stück)"]
["abschnitt","tionszeit","zeit","gesamt","je Einheit","einheiten","gesamt","je Einheit"]
[]
["Jungsauen(S0)",53,{"$f":"INT(B26/C9)*C9+C9","v":56},{"$f":"B26/C9*E26","v":128.85429085723638},{"$f":"(E31*(H8/100)/(H7/100))/((100-H11)/100)","v":17.018491245295372},{"$f":"C26/C9","v":8},{"$f":"INT(H26+0.5)*F26","v":144},{"$f":"E26/0.95","v":17.914201310837235}]
[]
["Deckbereich (S1)",32,{"$f":"INT(B28/C9)*C9+C9","v":35},{"$f":"B28/C9*E28","v":271.9141640395996},{"$f":"(E31*((100-H8)/100)/(H6/100))+(E31*(H8/100)/(H7/100))","v":59.48122338366241},{"$f":"C28/C9","v":5},{"$f":"(INT(H28+0.5)+INT(H29+0.5))*F28","v":300},{"$f":"E31*((100-H8)/100)/(H6/100)","v":42.973286875725904},"AS"]
[null,null,null,null,null,"Eberplätze",{"$f":"INT(SQRT(C6/9)-0.5)","v":10},{"$f":"E31*(H8/100)/(H7/100)","v":16.50793650793651},"JS"]
[null,null,null,null,null,null,{"$f":"INT(H30)*F28","v":10},{"$f":"(H29+H28)*0.05","v":2.9740611691831207},"Res."]
["Wartebereich",{"$f":"114-B28","v":82},{"$f":"INT(B31/C9)*C9+C9","v":84},{"$f":"B31/C9*E31","v":557.82312925170061},{"$f":"IF(C4=\"S\",C6/((B31+B34+B28)/C9),E34)","v":47.61904761904762},{"$f":"C31/C9","v":12},{"$f":"INT((H31+H32))*F31","v":576},{"$f":"(E31*(100-H8)/100)","v":35.238095238095241},"AS"]
["(S2)",null,null,null,null,null,null,{"$f":"(E31*(H8/100)+0.5)","v":12.880952380952381},"JS"]
[null,null,null,null,null,null,{"$f":"INT(H33)*F31","v":24},{"$f":"(H32+H31)*0.05","v":2.4059523809523813},"Res."]
["Abferkelber.(S3)",{"$f":"C8+5","v":33},{"$f":"INT(B34/C9)*C9+C9","v":35},{"$f":"B34/C9*E34","v":224.48979591836735},{"$f":"IF(C4=\"S\",C6/((B34+B28+B31)/C9),IF(C4=\"L\",C6/((100-H10)/100)/((100-H13)/100)/((100-H12)/100)/C11,G34/F34))","v":47.61904761904762},{"$f":"C34/C9","v":5},{"$f":"IF(C4=\"A\",C6,INT(H34+0.5)*F34)","v":240},{"$f":"E34","v":47.61904761904762}]
[null,null,null,null,null,null,{"$f":"INT(H35+0.5)*F34","v":15},{"$f":"H34*0.07","v":3.3333333333333339},"Res."]
["Ferkel (F)",{"$f":"C8","v":28},null,{"$f":"INT(B36/C9*E36+0.5)","v":1890},{"$f":"E34*C11*(100-H12/2)/100","v":472.5}]
[]
["Läufer (LM0)",{"$f":"INT((C12-(1.3+0.23*C8))/C13*1000+0.5)","v":48},{"$f":"IF(INT(B38/C9)*C9+C9=B38,INT(B38/C9)*C9+2*C9,INT(B38/C9)*C9+C9)","v":49},{"$f":"B38/C9*E38","v":3005.6571428571424},{"$f":"E34*C11*(100-H12)/100*((100-H13/2)/100)","v":438.32499999999999},{"$f":"C38/C9","v":7},{"$f":"INT(H38)*F38","v":3115},{"$f":"E34*C11*(100-H12)/100","v":445}]
[{"$f":"IF(H14=\"J\",\"eigene Reproduktion und Jungsauenverkauf :\",\"eigene Reproduktion :\")","v":"eigene Reproduktion :"}]
["Jungschw. (L1)",{"$f":"IF(C14=\"J\",(B16-C12)*1000/C16,IF(H14=\"J\",(B16-C12)*1000/C16,0))","v":0},{"$f":"IF(B40=0,0,INT(B40/C9)*C9+C9)","v":0},{"$f":"B40/C9*E40","v":0},{"$f":"E42/((100-C18)/100)/((100-H16)/100)","v":0},{"$f":"C40/C9","v":0},{"$f":"INT(H40+0.5)*F40","v":0},{"$f":"E40/0.95","v":0}]
[]
["Jungschw. (L2)",{"$f":"IF(C14=\"J\",INT((B17-B16)*1000/C17),IF(H14=\"J\",INT((B17-B16)*1000/C17),0))","v":0},{"$f":"IF(B42=0,0,INT(B42/C9)*C9+C9)","v":0},{"$f":"B42/C9*E42","v":0},{"$f":"IF(C14=\"J\",IF(H14=\"J\",(H15+E26)/((100-H18)/100)/((100-H17)/100),E26/((100-H18)/100)/((100-H17)/100)),IF(H14=\"J\",H15/((100-H18)/100)/((100-H17)/100),0))","v":0},{"$f":"C42/C9","v":0},{"$f":"INT(H42+0.5)*F42","v":0},{"$f":"E42/0.95","v":0}]
["bei eigener Mast:"]
["Mastschweine",{"$f":"IF(C19=\"J\",(C20-C12)/(C21/1000),0)","v":116},{"$f":"IF(B44=0,0,INT((B44+C9)/C9)*C9)","v":119},{"$f":"B44/C9*E44","v":6939.8960399999996},{"$f":"IF(C19=\"J\",(D47+((I47)/365*C9))*(100-(H20+H21/2))/100,0)","v":418.78682999999995},{"$f":"C44/C9","v":17},{"$f":"INT(H44+0.5)*F44","v":7191},{"$f":"IF(C19=\"N\",0,(D47+I47/365*7))","v":423.017}]
[null,null,null,null,null,null,{"$f":"ROUND(28/C9*H44*0.12,-1)","v":200},"empfohlene Res."]
["Jahresproduktion:"]
["prod. Mastläufer/ Prod.-rhythmus",null,null,{"$f":"E34*C11*(100-H12)/100*((100-H13)/100)*(100-H10)/100-E40","v":423.017},"selektierte Jungschweine L1 zur Mast:",null,null,null,{"$f":"E40*365/C9*(C18/100)","v":0}]
["verkaufsfähige Mastläufer/Jahr:",null,null,{"$f":"IF(C19=\"J\",0,IF(OR(C14=\"J\",H14=\"J\"),E34*C11*(100-H12)/100*((100-H13)/100)*((100-H10)/100)*365/C9-E40*365/C9,E34*C11*(365/C9)*(100-H12)/100*((100-H13)/100)*((100-H10)/100)))","v":0},"selektierte Jungsauen aus L2:",null,null,null,{"$f":"E42*365/C9*H18/100","v":0}]
["produzierte Jungsauen/Jahr:",null,null,{"$f":"E42*((100-H17/2)/100)*((100-H18)/100)*365/C9","v":0}]
["produzierte Schlachtschweine/Jahr:",null,null,{"$f":"IF(C19=\"J\",G44*365/C44*(100-H20-H21)/100,0)","v":21835.864285714288},"nicht normgerechte Mastläufer:",null,null,null,{"$f":"E34*C11*(100-H12)/100*((100-H13)/100)*(H10/100)*365/C9","v":450.14928571428567}]
["gemerzte Sauen:",null,null,{"$f":"E26*365/C9*(100-H11)/100","v":860.77097505668951},"Notschlachtungen aus Mast:",null,null,null,{"$f":"IF(C19=\"J\",G44*365/C44*H21/100,0)","v":0}]
[]
[]
["Entwickler: MLU, A. Rudovsky; LfULG, Th. Heidenreich"]

{"sheet":"WD-Anfall","index":12,"n_rows":111,"n_cols":9,"rows_kept":111,"cut":false,"hidden":false,"merged":[[21,0,21,7],[26,0,26,7],[46,1,46,3],[2,0,3,0],[2,1,3,3],[2,4,3,4],[2,5,2,6],[2,7,3,7],[3,5,3,6],[6,0,6,7],[9,0,9,7],[13,0,13,7],[102,0,102,6],[49,0,49,6],[57,0,57,6],[61,0,61,6],[70,1,70,6],[82,0,82,6]]}
["Richtwerte für den monatlichen Wirtschaftsdüngeranfall im Stall pro Tier "]
["(Oberflächenwasser- und Silosickersafteinleitungen in die Gülle- und/oder Jauchelager sind extra zu erfassen)"]
["Tierart","Flachlauf-, Tretmist 1)- und Anbindestall mit Einstreu",null,null,"Tiefstreustall, ohne separaten Fressbereich","Tiefstreustall,",null,"Laufstall, Anbindestall"]
[null,null,null,null,null,"mit separatem Fressbereich"]
["Rinder","Frischmist","Stallmist","Jauche","Stallmist","Stallmist","Gülle","Gülle"]
[null,"[t/Tier]","[m³/Tier]","[m³/Tier]","[m³/Tier]","[m³/Tier]","[m³/Tier]","[m³/Tier]"]
["Zuchtkälber"]
["Kälber bis 3 Monate (ohne Mastkälber)",0.26,0.31,0.03,0.23,0.1,0.12,0.21]
["Kälber über 3 bis 6 Monate (ohne Mastkälber)",0.34,0.41,0.05,0.31,0.14000000000000001,0.19,0.35]
["Jungrinder"]
["Jungrinder über 6 Monate bis 1 Jahr",0.52,0.63,0.13,0.47,0.21,0.31,0.56000000000000005]
["Jungrinder/Färsen über 1 Jahr bis 2 Jahre",0.85,1.02,0.27,0.77,0.35,0.55000000000000004,1]
["Färsen über 2 Jahre",1.03,1.24,0.38,0.96,0.43,0.73,1.32]
["Mastrinder"]
["Mastkälber bis 3 Monate2)",0.22,0.27,7.0000000000000007E-2,0.2,0.09,0.22,0.4]
["Mastkälber über 3 bis 6 Monate2)",0.23,0.28000000000000003,0.11,0.22,0.1,0.27,0.5]
["Mastrinder über 6 Monate bis 1 Jahr",0.38,0.46,0.24,0.4,0.18,0.35,0.63]
["Mastrinder über 1 Jahr bis 2 Jahre",0.5,0.6,0.42,0.52,0.23,0.41,0.74]
["Mastrinder über 2 Jahre (einschl. Zuchtbullen)",0.64,0.77,0.45,0.67,0.3,0.55000000000000004,1]
["Rosa-Kalbfleisch-Erzeugung 50- 350 kg LM",0.3,0.36,0.04,0.27,0.12,0.18,0.33]
["Fresseraufzucht",0.38,0.46,0.04,0.35,0.16,0.25,0.46]
["Mutterkühe"]
["Mutter- und Ammenkühe 500 kg incl. 0,9 Kalb ",1,1.2,0.46,1,0.45,0.73,1.33]
["Mutter- und Ammenkühe 700 kg incl. 0,9 Kalb",1.32,1.59,0.5,1.35,0.6,0.92,1.67]
["Mutter- und Ammenkühe 500 kg ohne Kalb",0.73,0.88,0.42,0.74,0.33,0.62,1.1299999999999999]
["Mutter- und Ammenkühe 700 kg ohne Kalb",1.05,1.27,0.46,1.1000000000000001,0.5,0.8,1.46]
["Milchkühe 3)"]
["Milchkuh   5 000 kg (leichte Rassen)",1.1499999999999999,1.39,0.49,1.18,0.53,0.85,1.54]
["Milchkuh   6 000 kg",1.2,1.45,0.5,1.19,0.54,0.87,1.58]
["Milchkuh   7 000 kg (leichte Rassen)",1.23,1.48,0.52,1.2,0.54,0.89,1.62]
["Milchkuh   8 000 kg",1.25,1.51,0.53,1.21,0.54,0.92,1.67]
["Milchkuh   9 000 kg (leichte Rassen)",1.32,1.59,0.55000000000000004,1.22,0.55000000000000004,0.94,1.71]
["Milchkuh 10 000 kg",1.33,1.6,0.56999999999999995,1.23,0.55000000000000004,0.96,1.75]
["Milchkuh 12 000 kg",1.42,1.71,0.6,1.25,0.56000000000000005,1.01,1.83]
["Melkhausabwasser4)",null,null,null,null,null,null,0.255]
["1 )Bei Tretmist ist der Jaucheanfall zu halbieren"]
["2) ohne Melkhausabwasser"]
["3) bei Milchkühen ergeben sich die Anfallswerte flüssiger Wirtschaftsdünger zuzüglich 0,255 m³"]
["4) Melkhausabwasser pro Tier und Monat"]
[]
["Rindermist:","22 - 25 % TS ",null,"Rinderjauche:",null,"3 % TS"]
["Rindergülle:","11 - 12 % TS",null,"Melkhausabwasser:",null,"1 % TS,"]
[]
[null,"    "]
[]
["Fortsetzung der Tabelle 1:"]
["Tierart","Flachstreu",null,null,"Tiefstreu","ohne Einstreu","Reinigungs-wasser"]
[null,"Frischmist","Frischmist","Jauche1)","Stallmist","Gülle1)"]
[null,"[t/Tier]","[m³/Tier]","[m³/Tier]","[m³/Tier]","[m³/Tier]","[m³/Tier]"]
["Schafe und Ziegen"]
["Schafe unter 1 Jahr und Hammel",7.3999999999999996E-2,0.114,null,0.08]
["Mutterschafe",9.1999999999999998E-2,0.14199999999999999,null,0.1]
["Mastlämmer",4.5999999999999999E-2,7.0999999999999994E-2,null,0.05]
["Weibliche Schafe über 1 Jahr (Zutreter)",8.3000000000000004E-2,0.128,null,0.09]
["Andere Schafe über 1 Jahr (Böcke)",0.11,0.16900000000000001,null,0.12]
["Mutterziegen",8.3000000000000004E-2,0.128,null,0.09]
["Andere Ziegen (unter 1 Jahr)",5.5E-2,8.5000000000000006E-2,null,0.06]
["Pferde"]
["Pferde unter 6 Monate, Aufzuchtponys bis 3 Jahre",0.28299999999999997,0.47,null,0.35]
["Pferde über 6 Monate bis 3 Jahre, Kleinpferde, Ponys",0.56599999999999995,0.94,null,0.7]
["Reit- und Zuchtpferde über 3 Jahre",0.93300000000000005,1.6,null,1.1000000000000001]
["Schweine"]
["Zuchtsauen ab 1. Belegung, güst u. tragend",0.24,0.27,0.08,0.2,0.26,0.02]
["Zuchtsauen laktierend",0.49,0.54,0.18,0.4,0.45,0.08]
["Ferkel 8 bis 28 kg",3.1E-2,3.4000000000000002E-2,1.7000000000000001E-2,0.03,4.2000000000000003E-2,8.0000000000000002E-3]
["Jungsauenaufzucht 28 -95 kg",0.115,0.13,0.04,0.13,0.14000000000000001,0.01]
["Jungsaueneingliederung 95-135 kg",0.155,0.17,0.06,0.15,0.19,0.02]
["Eberhaltung ab 50 kg",0.15,0.17,0.105,0.3,0.28000000000000003,0.02]
["Mastschweine 28 bis 115 kg Trockenfütterung ",0.09,0.1,4.2000000000000003E-2,0.12,0.125,8.0000000000000002E-3]
["Mastschweine 28 bis 115 kg Flüssigfütterung",0.09,0.1,5.1999999999999998E-2,0.12,0.155,8.0000000000000002E-3]
["Melkhausabwasser2)",4.4999999999999998E-2]
[]
[" 4) bei Milchschafen und -ziegen ergeben sich die Anfallswerte flüssiger Wirtschaftsdünger zuzüglich 0,045 m³"]
["Melkhausabwasser pro Tier und Monat"]
[]
["Schweinemist:","22 - 25 ","% TS,","Schweinegülle (Flüssigfütterung und Jungsauen)",null,null,"6    % TS"]
["Pferdemist:",25,"% TS,","Schweinegülle (Sauen und Ferkel)",null,null,"4    % TS","   "]
["Schafmist:",40,"% TS,","Schweinegülle (Trockenfütterung)",null,null,"7,5 % TS","   "]
[null,null,null,"Schweinejauche:",null,null,"3    % TS",null,"  "]
["Fortsetzung der Tabelle 1:"]
["Tierart","Frischmist","Frischmist","Tiefstreu 1)","Trockenkot 1),2)","Jauche 1),2)","Gülle1)"]
[null,"[t/100 Tiere]","m³/100 Tiere","[m³/100 Tiere]","[m³/100 Tiere]","[m³/100 Tiere]","[m³/100 Tiere]"]
["Geflügel"]
["Legehennen über 6 Monate",0.18329999999999999,{"$f":"B84/0.8","v":0.22912499999999997},0.25,0.25]
["Küken und Junghennen zur Aufzucht als Legehennen",5.8299999999999998E-2,{"$f":"B85/0.8","v":7.2874999999999995E-2},0.09,0.08]
["Masthähnchen (Broiler), Mast über 39 d",9.8400000000000001E-2,0.123,0.12]
["Masthähnchen (Broiler), Mast über 34 d",9.2499999999999999E-2,0.11562499999999999,0.12]
["Masthähnchen (Broiler), Mast 30-33 d",8.3299999999999999E-2,0.104125,0.1]
["Masthähnchen (Broiler), Mast bis 29 d",7.7499999999999999E-2,9.6874999999999989E-2,0.1]
["Enten zur Zucht",0.85,1.0625,0.8]
["Mastenten (Pekingenten)",0.48,0.6,0.6]
["Mastenten (Flugenten)",0.38300000000000001,0.47875000000000001,0.48]
["Gänse zur Zucht",0.95,1.1874999999999998,0.9]
["Mastgänse (Kurzmast, 5,0 kg)",0.13830000000000001,0.172875,0.13]
["Mastgänse (Mittelmast, 6,8 kg)",0.31169999999999998,0.38962499999999994,0.3]
["Mastgänse (Langmast, 7,8 kg)",0.51329999999999998,0.64162499999999989,0.48]
["Mastputen (Hennen) bis 17 Wochen",0.42,{"$f":"B97/0.5","v":0.84},0.63]
["Mastputen (Hähne) bis 21 Wochen",0.40329999999999999,{"$f":"B98/0.5","v":0.80659999999999998},0.6]
["Mastputen Hennen ab 6. Woche",0.5,1,0.75]
["Mastputen Hähne ab 6. Woche",0.50838000000000005,1.0167600000000001,0.76]
["Gemischtgeschlechtliche Mast, incl. Aufzucht",0.41199999999999998,0.82399999999999995,0.62]
["Putenaufzucht bis 5 Wochen, gemischtgeschlechtlich",0.11,0.22,0.22]
["Kaninchen"]
["Kaninchen (einschließlich Nachzucht, geschlossenes System)",10.130000000000001,10.96,8.2200000000000006,3.39,4.75,7.46]
["Mastkaninchen",0.93799999999999994,{"$f":"B105/0.9","v":1.0422222222222222},0.9,0.31,0.44,0.68799999999999994]
["Zuchtkaninchen mit Absetzer",2.3250000000000002,2.5833333333333335,2.1,0.77,1.08,1.7]
["1) ohne Reinigungsabwasser"]
["2) Lagerzeit auf den Kotbändern länger als 48 h und Kotbelüftung; bei Kaninchen: Kot-Harn-Trennung"]
[]
["Geflügelmist:","45 % TS,","Kaninchengülle:",null,"15 % TS,"]
["Geflügeltrockenkot:","60 % TS, ","Kaninchenjauche:",null,"  3 % TS"]

{"sheet":"MAKRO1.XLM","index":13,"n_rows":18,"n_cols":10,"rows_kept":18,"cut":false,"hidden":false,"merged":[]}
["Aufzeichnung1 (a)","Aufzeichnung2 (b)","Aufzeichnung3 (d)","Aufzeichnung4 (e)","Aufzeichnung5 (f)","Aufzeichnung6 (g)","Aufzeichnung7 (j)","Aufzeichnung9 (m)","Aufzeichnung10 (n)","Aufzeichnung11 (o)"]
[{"$f":"SELECT(\"Z8S2\")","v":true},{"$f":"SELECT(\"Z8S2:Z8S5;Z10S2:Z10S5;Z12S2:Z12S5;Z14S2:Z14S5;Z16S2:Z16S5;Z18S2:Z18S5;Z20S2:Z20S5;Z22S2:Z22S5\")","v":true},null,null,{"$f":"SELECT(\"Z7S2\")","v":false},null,{"$f":"SELECT(\"Z7S2:Z7S6;Z10S2:Z10S6;Z12S2:Z12S6;Z14S2:Z14S6;Z16S2:Z16S6;Z18S2:Z18S6;Z20s2:z20s6;z22s2:z22s6;Z24s2:z24s6;z26s2:z26s6;z28s2:z28s6;z30s2:z30s6;z32s2:z32s6;z34s2:z34s6;z36s2:z36s6;z9s6:z37s6;z44s2:z46s5\",\"Z18S2\")","v":true},{"$f":"WORKBOOK.SELECT(\"Lager_Ri\",\"Lager_Ri\")","v":false},{"$f":"SELECT(\"Z7S2\")","v":true},{"$f":"SELECT(\"Z8S2\")","v":true}]
[{"$f":"FORMULA(\"=TIPLA_S!Z26S7\")","v":true},{"$f":"CLEAR(3)","v":true},{"$f":"WORKBOOK.SELECT(\"TIPLA_S\",\"TIPLA_S\")","v":false},{"$f":"WORKBOOK.SELECT(\"Lager_Schwein\",\"Lager_Schwein\")","v":false},{"$f":"FORMULA(\"=Tipla_Mi!Z26S3\")","v":false},{"$f":"WORKBOOK.SELECT(\"Tipla_Mi\",\"Tipla_Mi\")","v":false},{"$f":"CLEAR(3)","v":true},{"$f":"WORKBOOK.ACTIVATE(\"Lager_Ri\")","v":false},{"$f":"FORMULA(\"=Tipla_Mi!Z25S3\")","v":false},{"$f":"FORMULA(\"=TIPLA_S!Z26s4\")","v":true}]
[{"$f":"SELECT(\"Z10S2\")","v":true},{"$f":"SELECT(\"Z7S2\")","v":true},{"$f":"WORKBOOK.ACTIVATE(\"TIPLA_S\")","v":false},{"$f":"WORKBOOK.ACTIVATE(\"Lager_Schwein\")","v":false},{"$f":"SELECT(\"Z10S2\")","v":false},{"$f":"WORKBOOK.ACTIVATE(\"Tipla_Mi\")","v":false},{"$f":"RETURN()","v":false},{"$f":"SELECT(\"Z9S1\")","v":true},{"$f":"RETURN()","v":true},{"$f":"SELECT(\"Z10S2\")","v":true}]
[{"$f":"FORMULA(\"=TIPLA_S!Z28S7+TIPLA_S!Z31S7\")","v":true},{"$f":"RETURN()","v":true},{"$f":"VLINE(-10)","v":true},{"$f":"SELECT(\"Z7S2\")","v":true},{"$f":"FORMULA(\"=Tipla_Mi!Z33S7\")","v":false},{"$f":"VLINE(-40)","v":true},{"$f":"SELECT(\"Z9S1\")","v":true},{"$f":"RETURN()","v":true},{"$f":"SELECT(\"Z10S2\")","v":true},{"$f":"FORMULA(\"=TIPLA_S!Z28s4+TIPLA_S!Z31s4\")","v":true}]
[{"$f":"SELECT(\"Z12S2\")","v":true},null,{"$f":"SELECT(\"Z6S3\")","v":true},{"$f":"RETURN()","v":true},{"$f":"SELECT(\"Z12S2\")","v":false},{"$f":"SELECT(\"Z4S3\")","v":true},{"$f":"RETURN()","v":false},null,{"$f":"FORMULA(\"=Tipla_Mi!Z32S7\")","v":false},{"$f":"SELECT(\"Z12S2\")","v":true}]
[{"$f":"FORMULA(\"=TIPLA_S!Z34S7+TIPLA_S!Z35S7\")","v":true},null,{"$f":"RETURN()","v":true},null,{"$f":"FORMULA(\"=Tipla_Mi!Z54S6+Tipla_Mi!Z56S6\")","v":false},{"$f":"RETURN()","v":true},null,null,{"$f":"SELECT(\"Z12S2\")","v":true},{"$f":"FORMULA(\"=TIPLA_S!Z34s4+TIPLA_S!Z35s4\")","v":true}]
[{"$f":"SELECT(\"Z14S2\")","v":true},null,null,null,{"$f":"SELECT(\"Z14S2\")","v":false},null,null,null,{"$f":"FORMULA(\"=Tipla_Mi!Z34S7+Tipla_Mi!Z36S7\")","v":false},{"$f":"SELECT(\"Z14S2\")","v":true}]
[{"$f":"FORMULA(\"=TIPLA_S!Z38S7\")","v":true},null,null,null,{"$f":"FORMULA(\"=Tipla_Mi!Z58S6\")","v":false},null,null,null,{"$f":"SELECT(\"Z14S2\")","v":true},{"$f":"FORMULA(\"=TIPLA_S!Z38s4\")","v":true}]
[{"$f":"SELECT(\"Z16S2\")","v":true},null,null,null,{"$f":"SELECT(\"Z16S2\")","v":false},null,null,null,{"$f":"FORMULA(\"=Tipla_Mi!Z38S7\")","v":false},{"$f":"SELECT(\"Z16S2\")","v":true}]
[{"$f":"FORMULA(\"=TIPLA_S!Z29S7\")","v":true},null,null,null,{"$f":"FORMULA(\"=Tipla_Mi!Z60S6\")","v":false},null,null,null,{"$f":"SELECT(\"Z16S2\")","v":true},{"$f":"FORMULA(\"=TIPLA_S!Z29s7\")","v":true}]
[{"$f":"SELECT(\"Z18S2\")","v":true},null,null,null,{"$f":"SELECT(\"Z18S2\")","v":false},null,null,null,{"$f":"FORMULA(\"=Tipla_Mi!Z40S7\")","v":false},{"$f":"SELECT(\"Z18S2\")","v":true}]
[{"$f":"FORMULA(\"=TIPLA_S!Z40S7+TIPLA_S!Z42S7\")","v":true},null,null,null,{"$f":"FORMULA(\"=Tipla_Mi!Z62S6+Tipla_Mi!Z42S3\")","v":false},null,null,null,{"$f":"SELECT(\"Z18S2\")","v":true},{"$f":"FORMULA(\"=TIPLA_S!Z40s4+TIPLA_S!Z42s4\")","v":true}]
[{"$f":"SELECT(\"Z20S2\")","v":true},null,null,null,{"$f":"SELECT(\"Z9S1\")","v":false},null,null,null,{"$f":"FORMULA(\"=Tipla_Mi!Z42S7+Tipla_Mi!Z27S3\")","v":false},{"$f":"SELECT(\"Z20S2\")","v":true}]
[{"$f":"FORMULA(\"=TIPLA_S!Z44S7\")","v":true},null,null,null,{"$f":"FORMULA(\"=Tipla_Mi!Z6S3\")","v":false},null,null,null,{"$f":"SELECT(\"Z9S1\")","v":true},{"$f":"FORMULA(\"=TIPLA_S!Z44s4\")","v":true}]
[{"$f":"SELECT(\"Z8S3\")","v":true},null,null,null,{"$f":"SELECT(\"Z7S3\")","v":false},null,null,null,{"$f":"FORMULA(\"=Tipla_Mi!Z5S4\")","v":false},{"$f":"SELECT(\"Z8S3\")","v":true}]
[{"$f":"RETURN()","v":true},null,null,null,{"$f":"RETURN()","v":false},null,null,null,{"$f":"SELECT(\"Z7S3\")","v":true},{"$f":"RETURN()","v":true}]
[null,null,null,null,null,null,null,null,{"$f":"RETURN()","v":false}]

{"sheet":"MAKRO2.XLM","index":14,"n_rows":14,"n_cols":1,"rows_kept":14,"cut":false,"hidden":false,"merged":[]}
["Aufzeichnung2 (q)"]
[{"$f":"SELECT(\"Z7S2\")","v":true}]
[{"$f":"FORMULA(\"=[LAGERKA.XLW]Tipla_Mi!Z19S3+[LAGERKA.XLW]Tipla_Mi!Z20S3+[LAGERKA.XLW]Tipla_Mi!Z22S3+[LAGERKA.XLW]Tipla_Mi!Z23S3\")","v":true}]
[{"$f":"SELECT(\"Z10S2\")","v":true}]
[{"$f":"FORMULA(\"=[LAGERKA.XLW]Tipla_Mi!Z32S6\")","v":true}]
[{"$f":"SELECT(\"Z12S2\")","v":true}]
[{"$f":"FORMULA(\"=[LAGERKA.XLW]Tipla_Mi!Z34S6+[LAGERKA.XLW]Tipla_Mi!Z36S6\")","v":true}]
[{"$f":"SELECT(\"Z14S2\")","v":true}]
[{"$f":"FORMULA(\"=[LAGERKA.XLW]Tipla_Mi!Z38S6\")","v":true}]
[{"$f":"SELECT(\"Z16S2\")","v":true}]
[{"$f":"FORMULA(\"=[LAGERKA.XLW]Tipla_Mi!Z40S6\")","v":true}]
[{"$f":"SELECT(\"Z18S2\")","v":true}]
[{"$f":"FORMULA(\"=[LAGERKA.XLW]Tipla_Mi!Z24S3+[LAGERKA.XLW]Tipla_Mi!Z42S6\")","v":true}]
[{"$f":"RETURN()","v":true}]